program: Gaussian 09
title: 000125555
version: EM64L-G09RevD.01
frameworkgroup: C1[X(C23H31NO2)]
method: RPBEPBE
basis: SDD
operation: Freq
keyword: #p
keyword: freq=noraman
keyword: PBEPBE/SDD
title: #p freq=noraman PBEPBE/SDD
converged: YES YES NO NO
title: Mulliken charges:
elementType: O O N C C C C C C C C C C C C C C C C C C C C C C C H H H H H H H H H H H H H H H H H H H H H H H H H H H H H H H
charge: -0.326353 -0.307413 -0.395691 -0.248230 -0.020984 -0.445447 -0.447646 -0.396258 -0.392210 -0.201872 -0.130141 -0.498075 0.530605 -0.490289 0.416460 -0.391369 0.494797 0.297533 -0.451445 -0.394307 -0.824410 -0.826880 -0.237928 -0.269389 -0.739104 -0.243468 0.207579 0.236818 0.220032 0.210010 0.215842 0.205538 0.205458 0.192190 0.205414 0.199121 0.254348 0.191359 0.239681 0.222867 0.226270 0.210614 0.321535 0.212096 0.230350 0.251920 0.228079 0.233752 0.224608 0.223629 0.243627 0.219912 0.223425 0.229395 0.214063 0.214674 0.225309
chargesum: 0.00000
title: Mulliken charges with hydrogens summed into heavy atoms:
elementType: O O N C C C C C C C C C C C C C C C C C C C C C C C
charge: -0.326353 -0.307413 -0.074155 -0.040651 0.215833 -0.015406 -0.026267 0.001389 0.012325 0.052476 0.061218 -0.035527 0.530605 -0.053406 0.416460 -0.179273 0.494797 0.297533 -0.221095 -0.142387 -0.137970 -0.139712 -0.014503 -0.039994 -0.310368 -0.018159
polarizability: 2.95532920e+02 3.45862009e+01 2.65639360e+02 3.93958128e+00 -2.86067123e+00 1.97595577e+02
1716.lowfreq: -6.3284 -1.9083 -0.0009 -0.0008 -0.0003 9.9243 12.3941 14.2340 25.7465
frequency: 12.1868 13.2701 25.6441 29.3518 36.3616 51.1762 63.6800 67.1076 82.2681 99.9510 112.6240 149.8159 157.5808 161.2635 167.0824 184.4237 214.5186 231.3441 239.8527 250.7619 265.4792 281.5038 308.8398 319.1298 319.6226 340.7726 389.8064 401.9375 413.5757 429.9494 442.7089 447.6841 476.7358 489.2743 511.7378 522.8278 533.8318 562.1991 590.2469 608.9453 616.8719 619.8979 648.5222 670.9436 695.4440 700.9709 705.1209 762.7334 778.0147 782.0059 812.5134 813.7309 841.7793 852.8321 858.8293 863.5390 886.3870 895.7507 912.0535 915.2610 922.5310 926.9952 941.4147 954.8022 969.7288 975.0734 983.3839 990.6929 991.2505 994.0033 995.9986 1015.0955 1028.7679 1041.1733 1045.5268 1046.7933 1052.2074 1061.8882 1077.8855 1091.7134 1097.0668 1105.6011 1119.2472 1131.5231 1136.1681 1161.5583 1171.0280 1171.4224 1185.5958 1194.7690 1196.1556 1220.1997 1220.7740 1232.7145 1245.4208 1251.8331 1259.2424 1277.0230 1295.3252 1298.7233 1303.2542 1306.5028 1316.7482 1322.6238 1328.8349 1333.7831 1338.0349 1343.7175 1349.3730 1359.5482 1372.0874 1372.3800 1385.9777 1395.1242 1395.3483 1428.6778 1442.2756 1451.8819 1458.6331 1460.2714 1462.7027 1463.7508 1465.1967 1467.0719 1470.3956 1475.5682 1476.7152 1478.8387 1485.6459 1591.2793 1613.3890 1650.8613 1664.9128 1689.8319 2930.9701 2956.1847 2964.2821 2966.8681 2967.1132 2970.3867 2974.5315 2977.3676 2984.6200 2990.0152 3009.0887 3014.6874 3020.2804 3033.6700 3037.8830 3038.1769 3041.2395 3045.5178 3056.8147 3061.1411 3079.8367 3084.1185 3093.8917 3098.0128 3110.6928 3121.8363 3134.0766 3145.2465 3160.3422 3195.5433 3562.6430
redmass: 4.0943 3.7462 2.9581 4.5711 4.4779 3.7131 4.6401 4.7041 3.7709 3.5443 3.6696 3.6699 2.5908 1.1040 1.2542 2.9342 3.4510 3.1902 5.0767 3.9919 2.5421 3.2117 3.5978 2.5911 2.0560 2.7687 4.0404 2.8089 2.7458 2.7907 2.8921 2.9350 2.7978 2.5452 2.4379 2.7727 2.8955 1.4781 2.4986 3.2680 6.3082 4.0199 3.8995 6.0458 7.7766 1.2124 1.7553 1.9701 2.4760 2.4076 1.2643 2.4105 1.9364 1.2576 2.1241 1.8065 1.8589 2.7395 1.5807 2.1257 1.5323 1.7308 2.2769 2.2946 2.1349 1.4066 2.4834 3.3702 2.3815 1.4610 1.6776 2.4523 2.1085 1.6564 1.5789 1.7221 1.6997 1.4329 1.7076 2.1350 3.2234 2.3827 1.9386 2.2254 2.0502 2.1120 1.0662 1.3937 2.0135 1.1635 1.7003 1.6240 1.4620 1.5626 1.3165 1.5914 1.5372 1.3254 1.4548 1.2998 1.3869 1.3603 1.3697 1.3912 1.3093 1.3680 1.3988 1.4320 1.4702 2.0349 1.7526 1.7069 3.4607 1.2353 1.2217 1.1826 2.1097 1.0890 1.2060 1.0758 1.3577 1.1004 1.0914 1.1234 1.0888 1.0666 1.1074 1.0655 2.2047 5.8760 6.0283 9.8756 4.7674 6.8499 1.0804 1.0629 1.0374 1.0384 1.0764 1.0636 1.0631 1.0681 1.0628 1.0645 1.0819 1.0957 1.0840 1.0958 1.0993 1.0960 1.0951 1.1015 1.1022 1.1004 1.0990 1.0988 1.0906 1.0627 1.0867 1.0861 1.0913 1.0956 1.1013 1.1126 1.0773
irintensity: 0.0198 0.0437 0.1940 0.0706 0.3975 0.4103 5.4509 3.5296 0.7843 0.3106 0.0974 0.5656 0.2563 0.8538 0.0880 0.3103 1.7757 3.9201 6.4628 3.2675 2.4686 2.3976 0.9214 3.7738 0.4355 1.3519 3.8097 0.3096 5.8800 2.6206 2.8907 1.5327 5.4272 3.9948 12.9578 16.0348 3.9104 69.3597 35.5118 10.2296 0.2139 3.2272 1.1887 2.2389 22.6658 3.2756 58.8191 46.8962 10.0729 1.9845 9.9103 2.1373 5.1994 0.7756 3.9160 4.8247 7.0819 2.9786 2.8128 5.7955 47.9303 35.9305 43.7274 10.6714 15.6740 0.0358 4.0613 3.2312 5.5526 10.1336 113.8836 183.8689 9.0481 27.8880 13.0468 2.0898 3.1508 1.9515 8.6266 5.8490 32.1905 0.2506 20.6882 8.2424 3.2408 5.2886 0.2150 6.8345 256.2450 12.7388 0.5449 0.3993 8.0901 0.1113 1.4049 4.7948 4.7546 1.9827 12.9367 1.3146 5.4017 0.4472 47.4661 1.9050 0.8737 0.8261 0.2785 15.9776 0.0244 1.6303 1.3101 2.1976 0.0360 16.0159 17.9562 3.4693 7.5492 4.9592 104.7529 12.1309 266.9586 31.4128 6.1982 55.8465 14.2049 34.3629 3.0955 17.2499 23.8433 1.8564 10.5864 260.8503 33.2365 0.9024 13.9768 31.7113 35.6693 25.8949 4.5983 37.6071 34.1494 32.3629 19.6979 16.0694 12.9916 30.5445 33.1514 61.1843 45.9192 21.0704 18.9201 30.5934 57.5851 34.3413 22.7485 31.7786 46.2473 10.5525 8.1107 0.2867 20.6831 32.1977 18.4353 26.2254 26.8175
temp: 298.150 k
press: 1.00000 atm
elementType: 8 8 7 6 6 6 6 6 6 6 6 6 6 6 6 6 6 6 6 6 6 6 6 6 6 6 1 1 1 1 1 1 1 1 1 1 1 1 1 1 1 1 1 1 1 1 1 1 1 1 1 1 1 1 1 1 1
symmnumber: 1
zpe: 1282797.0 jmol-1
zpe.correction: 0.488592 hartree
zpe.thermalcorrener: 0.514586 hartree
zpe.thermalcorrenthalpy: 0.515531 hartree
zpe.thermalcorrgfe: 0.429074 hartree
zpe.sumelectzpe: -1098.288590 hartree
zpe.sumelectthermal: -1098.262596 hartree
zpe.sumelectthermalent: -1098.261651 hartree
zpe.sumelectthermalfe: -1098.348108 hartree
dipole: -0.4083 -0.2628 -2.1366
dipole: 2.1911
quadrupole: -146.1891 -151.6316 -157.6903
quadrupole: 0.1529 1.6789 2.3223
quadrupole: 5.6479 0.2054 -5.8533 0.1529 1.6789 2.3223
hfenergy: -1098.777182 hartree
pointgroup: C01 [X(C23H31N1O2)]
dipole: 0.1895663 0.1227475 -0.8319256 debye
polarizability: 280.6549063|37.4812055|280.849991|0.3719129|3.2618385|197.2629603 unknown
InChI: InChI=1S/C23H31NO2/c1-16(2)19-14-13-17(3)21(15-19)24-23(25)26-22-12-8-7-11-20(22)18-9-5-4-6-10-18/h4-6,9-10,13,19-22,24H,1,7-8,11-12,14-15H2,2-3H3
charge 0 multiplicity 1
57 atoms
O  0.854431 1.664406 -0.428747
O  -0.115192 1.632557 1.733762
N  -1.392515 1.400988 -0.222076
C  3.068017 0.593175 -0.35125
C  2.218861 1.777277 0.163724
C  4.525791 0.75064 0.187485
C  2.809878 3.136585 -0.247937
C  5.144427 2.112558 -0.203494
C  4.258524 3.285545 0.277131
C  -2.695709 1.19878 0.457733
C  -3.478025 -1.019885 -0.573361
C  -2.989909 -0.301343 0.717677
C  2.509921 -0.785373 0.001262
C  -4.810018 -0.371037 -1.011342
C  -3.800843 1.881349 -0.349819
C  -4.746374 1.14575 -0.998954
C  -3.519562 -2.540401 -0.397052
C  -0.222495 1.56556 0.478735
C  2.573847 -1.831819 -0.954301
C  1.990136 -1.082034 1.288835
C  -3.784415 3.397304 -0.364451
C  -2.165104 -3.230836 -0.433371
C  2.141158 -3.139289 -0.638473
C  1.554293 -2.387388 1.608881
C  -4.665607 -3.253304 -0.223989
C  1.630466 -3.423425 0.649066
H  3.108822 0.678832 -1.457469
H  2.108209 1.737728 1.264209
H  5.141285 -0.08442 -0.196983
H  4.512036 0.649169 1.292205
H  2.166392 3.946644 0.142596
H  2.800516 3.212135 -1.353581
H  6.161974 2.200297 0.223546
H  5.252691 2.163616 -1.306642
H  4.679268 4.252743 -0.05717
H  4.248916 3.307295 1.386261
H  -2.591947 1.703099 1.438259
H  -2.723106 -0.808231 -1.364594
H  -2.079111 -0.77298 1.127449
H  -3.781084 -0.385229 1.488904
H  -5.097494 -0.730675 -2.018888
H  -5.626402 -0.694254 -0.330929
H  -1.336552 1.324299 -1.238647
H  -5.543378 1.674598 -1.542321
H  2.966246 -1.616874 -1.956685
H  1.902971 -0.292909 2.044128
H  -3.93829 3.804871 0.654523
H  -2.806863 3.783405 -0.711888
H  -4.571703 3.808629 -1.019768
H  -1.689998 -3.109194 -1.42729
H  -1.458305 -2.797672 0.299613
H  -2.252714 -4.311252 -0.22636
H  2.200682 -3.932227 -1.393038
H  1.153631 -2.594401 2.607924
H  -4.639455 -4.341255 -0.090497
H  -5.657857 -2.790228 -0.216033
H  1.293941 -4.436007 0.899595
