program: Gaussian 09
title: 000125507
version: EM64L-G09RevD.01
frameworkgroup: C1[X(C13H24O12S)]
method: RPBEPBE
basis: SDD
operation: Freq
keyword: #p
keyword: freq=noraman
keyword: PBEPBE/SDD
title: #p freq=noraman PBEPBE/SDD
converged: NO YES NO NO
title: Mulliken charges:
elementType: S O O O O O O O O O O O O C C C C C C C C C C C C C H H H H H H H H H H H H H H H H H H H H H H H H
charge: 1.178764 -0.273929 -0.235856 -0.408460 -0.450832 -0.279311 -0.445563 -0.445638 -0.469424 -0.442210 -0.546521 -0.500830 -0.464371 0.008441 -0.198522 -0.083877 -0.006850 -0.111568 -0.058459 -0.004584 -0.281693 -0.066313 0.014002 -0.725421 -0.730516 -0.502899 0.263453 0.319793 0.215097 0.284084 0.245353 0.243792 0.226350 0.273108 0.197143 0.259923 0.207792 0.223193 0.267382 0.246998 0.264554 0.217498 0.366521 0.359492 0.362567 0.363226 0.234793 0.209856 0.234385 0.446088
chargesum: 0.00000
title: Mulliken charges with hydrogens summed into heavy atoms:
elementType: S O O O O O O O O O O O O C C C C C C C C C C C C C
charge: 1.178764 -0.273929 -0.235856 -0.408460 -0.450832 -0.279311 -0.079042 -0.086146 -0.106856 -0.078984 -0.100432 -0.500830 -0.464371 0.271894 0.121271 0.131220 0.277234 0.133784 0.185333 0.221766 -0.008585 0.130830 0.273925 -0.027054 -0.001467 0.176135
polarizability: 2.32419956e+02 2.11296852e-01 2.28232161e+02 -4.81339167e+00 -1.63932087e+00 1.73139705e+02
1716.lowfreq: -9.0251 -6.7139 0.0009 0.0010 0.0015 6.9791 18.3695 26.0483 39.7408
frequency: 18.1340 25.7764 39.6866 47.9893 67.3539 76.2004 82.9833 93.4935 105.7753 114.8959 120.0741 135.2239 140.1373 159.9032 179.7501 185.2048 201.1144 205.1468 212.2217 220.5179 229.1296 237.6530 249.1733 252.6275 265.7065 276.8473 282.1266 303.1431 317.4103 322.5847 326.2677 338.2686 347.9001 368.1733 375.0174 388.5596 393.1277 416.2043 432.1312 442.5894 450.5756 471.2004 500.2702 532.8766 545.3187 591.5185 615.6687 625.3132 635.8725 649.4942 674.6004 685.7954 729.8152 749.8759 752.4730 785.6247 834.4503 837.1690 860.4067 869.4625 890.9685 896.9414 926.9168 943.2274 948.4046 966.2542 973.5141 981.0881 986.1453 991.9297 1012.6819 1018.4656 1038.2162 1043.4745 1046.5407 1057.3048 1070.8165 1091.4460 1114.1532 1114.9488 1124.1790 1140.9473 1142.5196 1147.5207 1155.3737 1166.2778 1190.5235 1195.4244 1202.0245 1225.1147 1252.6391 1271.6738 1277.9398 1281.4470 1292.1175 1295.4882 1303.7632 1309.3184 1314.0087 1315.4878 1321.5584 1323.0404 1344.8688 1353.2360 1356.5236 1361.6180 1366.4651 1376.9412 1382.9473 1386.8641 1393.0508 1397.2326 1402.7525 1431.3436 1456.0244 1460.4835 1468.5305 1475.0146 1475.7639 1478.0138 2190.2094 2924.3440 2948.4138 2957.8061 2983.6566 2995.2417 3003.1124 3003.8135 3019.5159 3020.5931 3031.0722 3040.9053 3042.8735 3049.5925 3078.8991 3095.3657 3097.5446 3118.4296 3124.1081 3124.6643 3490.0310 3520.8118 3559.1234 3583.7428
redmass: 5.4160 6.8437 5.1304 5.5043 6.5911 4.2170 3.7336 5.4345 5.1306 6.2024 6.6772 1.4708 3.9358 5.3829 5.7839 2.0026 2.2321 1.4205 2.0124 3.1494 6.2652 4.4133 4.6526 3.1167 4.8028 5.4399 5.0454 1.1692 6.3449 4.3842 4.4094 8.5630 5.6736 3.6594 4.4341 6.6108 2.4445 2.1801 4.0726 3.0198 2.4286 2.5944 4.6199 1.1681 4.3334 5.6704 4.5542 4.0470 3.7865 8.4224 5.5926 5.7834 5.0829 3.9837 3.4841 4.7715 3.7462 3.5196 10.7609 3.6970 4.5517 3.9204 3.0372 3.1089 2.9072 3.0397 3.3722 3.8058 3.8492 2.5646 3.9027 3.9829 3.7690 2.6358 2.6412 3.0601 2.7125 2.2293 1.3136 1.3545 2.4384 2.1351 1.7085 2.2400 2.1713 1.6762 1.4588 1.2299 1.2145 1.1851 1.2649 1.2550 1.2341 1.2235 1.3388 1.1891 1.2519 1.2730 1.2359 1.2225 1.2130 1.2630 1.3349 1.2106 1.2796 1.2862 1.3430 1.7082 1.6875 1.5940 1.2371 1.2676 1.5650 1.1436 1.0511 1.0434 1.0445 1.0555 1.0535 1.0520 1.0854 1.0835 1.0837 1.0338 1.0828 1.0832 1.0382 1.0370 1.0860 1.0852 1.0845 1.0850 1.0860 1.1010 1.0890 1.0989 1.0984 1.1010 1.1014 1.1001 1.0647 1.0650 1.0654 1.0668
irintensity: 0.1229 0.7619 0.7674 2.1443 0.5621 2.6002 1.1009 2.4373 6.9638 10.3305 3.8773 1.0653 2.0251 1.2448 2.4105 5.3729 0.6941 1.3135 5.3080 4.6933 5.6487 16.4504 5.0000 5.1467 9.8346 3.3862 2.9679 35.9350 11.4821 3.2180 1.3413 16.2701 9.8049 16.7435 25.7947 17.5454 45.8775 78.4026 64.8136 33.0723 124.3933 15.1514 75.1916 156.0500 83.6397 37.0746 0.6382 11.4317 38.0989 102.3469 30.1584 27.2109 20.4627 7.9208 19.9986 94.7001 12.5670 22.4998 95.9021 26.1989 51.8684 172.8648 65.6354 22.9780 52.2831 138.6599 1.3384 125.2264 5.5789 56.3557 42.4330 37.4268 62.5166 47.9394 34.5889 181.6319 42.4563 155.3046 36.5549 68.8020 20.4884 18.4490 26.6779 34.9819 0.4432 69.4254 30.6013 18.1091 40.6611 16.6821 27.4939 16.0076 23.1520 13.5010 17.1729 0.7502 13.9073 7.4552 2.9163 14.3001 20.3574 2.9710 26.4410 64.7956 33.1708 13.7307 5.8112 9.3579 7.0221 8.6250 32.0723 38.2342 1.0699 5.6074 9.4548 9.5461 8.9549 8.8104 7.9764 11.0338 2191.1292 56.2696 30.8608 70.0317 29.6421 13.0299 30.0587 10.4920 28.3084 8.9147 10.9946 5.3272 19.7132 41.5227 6.7314 24.5014 17.1372 18.8184 6.3992 12.3016 25.6878 17.4070 17.1674 17.1068
temp: 298.150 k
press: 1.00000 atm
elementType: 16 8 8 8 8 8 8 8 8 8 8 8 8 6 6 6 6 6 6 6 6 6 6 6 6 6 1 1 1 1 1 1 1 1 1 1 1 1 1 1 1 1 1 1 1 1 1 1 1 1
symmnumber: 1
zpe: 1011606.4 jmol-1
zpe.correction: 0.385301 hartree
zpe.thermalcorrener: 0.413938 hartree
zpe.thermalcorrenthalpy: 0.414882 hartree
zpe.thermalcorrgfe: 0.326541 hartree
zpe.sumelectzpe: -1808.184471 hartree
zpe.sumelectthermal: -1808.155833 hartree
zpe.sumelectthermalent: -1808.154889 hartree
zpe.sumelectthermalfe: -1808.243230 hartree
dipole: -3.9488 -7.9258 3.3894
dipole: 9.4815
quadrupole: -150.4362 -172.0828 -161.1656
quadrupole: 12.1214 3.4926 -8.0255
quadrupole: 10.7920 -10.8546 0.0626 12.1214 3.4926 -8.0255
hfenergy: -1808.569771 hartree
pointgroup: C01 [X(C13H24O12S1)]
dipole: 1.9527732 2.4667876 2.0042361 debye
polarizability: 231.3971295|-2.3372282|225.8197682|8.7697126|11.3019933|176.5749243 unknown
InChI: InChI=1S/C13H24O12S/c1-4-6(14)8(16)9(17)12(22-4)24-11-10(25-26(18,19)20)7(15)5(2)23-13(11)21-3/h4-18H,1-3H3
charge 0 multiplicity 1
50 atoms
S  -1.243693 -2.986959 -0.858683
O  0.617243 0.728965 -0.235364
O  -2.597632 2.579474 -0.112902
O  1.735208 -1.347536 -0.635319
O  -1.310488 -1.185475 -1.462369
O  -1.170857 1.7266 1.642367
O  -3.335901 0.487255 -2.178966
O  2.525713 2.017142 -1.932137
O  4.788824 1.476212 -0.23415
O  4.704257 -1.275425 -0.051287
O  0.368449 -3.294789 -1.449152
O  -1.312748 -2.94695 0.756389
O  -2.28024 -3.859386 -1.705273
C  -0.769494 1.013762 -0.62578
C  -1.719579 -0.186174 -0.448914
C  -3.184009 0.221545 -0.7481
C  1.441295 0.002363 -1.166532
C  -1.249759 2.17993 0.263619
C  2.790164 0.720134 -1.323395
C  -3.598757 1.481511 0.043312
C  3.46971 0.852507 0.045541
C  3.685823 -0.538977 0.69214
C  2.376923 -1.35397 0.727614
C  -4.936193 2.062611 -0.409799
C  2.577811 -2.815476 1.122382
C  -1.37396 2.812488 2.613139
H  -0.805278 1.358881 -1.676492
H  -1.615517 -0.600823 0.571767
H  -3.850694 -0.613273 -0.436878
H  0.940174 -0.159913 -2.1344
H  -0.629166 3.081429 0.098307
H  3.431719 0.091596 -1.975479
H  -3.627728 1.199777 1.116415
H  2.853956 1.498753 0.698822
H  4.009057 -0.39857 1.749575
H  1.664523 -0.847015 1.406455
H  -5.745841 1.325951 -0.260338
H  -5.172046 2.969071 0.173167
H  -4.891143 2.318801 -1.479446
H  1.611205 -3.34311 1.1801
H  3.23999 -3.32148 0.402495
H  3.055168 -2.862265 2.117335
H  -2.933921 -0.284781 -2.658693
H  3.392254 2.495112 -1.994014
H  5.098463 1.984365 0.556395
H  5.39591 -0.608141 -0.311643
H  -2.361412 3.291776 2.476677
H  -0.579972 3.580165 2.513537
H  -1.314802 2.342529 3.606551
H  0.996489 -2.481918 -1.108397
