program: Gaussian 09
title: 000125469
version: EM64L-G09RevD.01
frameworkgroup: C1[X(C19H20O5)]
method: RPBEPBE
basis: SDD
operation: Freq
keyword: #pfreq=noraman
keyword: PBEPBE/SDD
title: #p freq=noraman PBEPBE/SDD
converged: YES YES NO NO
title: Mulliken charges:
elementType: O O O O O C C C C C C C C C C C C C C C C C C C H H H H H H H H H H H H H H H H H H H H
charge: -0.309818 -0.284180 -0.186806 -0.434397 -0.254811 0.115749 0.251386 0.372353 0.306038 0.028504 -0.552070 -0.413885 0.195476 -0.430957 -0.542049 -0.274481 -0.363233 -0.700284 0.215346 -0.791997 0.278662 -0.527592 0.089050 -0.756956 0.244611 0.211615 0.254512 0.234867 0.282353 0.231855 0.261822 0.226208 0.212138 0.248741 0.236073 0.258131 0.239191 0.234699 0.236072 0.222722 0.251654 0.252302 0.251268 0.380117
chargesum: 0.00000
title: Mulliken charges with hydrogens summed into heavy atoms:
elementType: O O O O O C C C C C C C C C C C C C C C C C C C
charge: -0.309818 -0.284180 -0.186806 -0.054280 -0.254811 0.115749 0.251386 0.372353 0.306038 0.028504 -0.095845 -0.159373 0.195476 -0.196089 -0.259696 -0.042626 -0.101410 -0.013197 0.215346 -0.058602 0.278662 0.165902 0.089050 -0.001732
polarizability: 3.64586166e+02 1.00384730e+01 2.62876168e+02 -7.04163610e+00 2.56743033e+00 1.34467232e+02
1716.lowfreq: -10.9023 -8.2924 -6.5458 -0.0009 -0.0006 -0.0005 15.1858 29.7444 40.1881
frequency: 13.1700 29.6639 40.1673 42.7749 49.7834 63.9074 64.3452 82.6175 85.3330 88.5357 107.1217 110.0934 158.2487 168.7799 177.1799 183.4736 203.6381 213.4248 218.4037 241.2212 275.3757 295.7641 302.5148 329.4173 340.4796 358.8444 387.2183 408.6662 430.7388 451.8542 485.4117 495.8562 516.3735 530.8284 539.3491 554.0704 558.2325 583.1086 601.7618 609.6691 653.3638 663.6633 699.6284 711.1958 718.6593 753.3603 778.5061 789.4087 801.4031 818.4423 834.7515 862.9219 891.2036 911.9037 920.5086 943.4980 969.0276 982.1783 983.9577 987.8772 1000.9337 1027.4213 1035.1374 1044.0638 1048.3810 1058.7034 1081.3403 1108.5208 1119.5807 1140.5978 1151.7565 1155.4132 1167.2235 1186.9231 1205.3265 1243.6281 1260.3916 1272.6775 1302.2236 1316.0122 1349.6701 1365.9027 1370.7860 1382.2172 1387.6130 1391.6881 1405.8071 1416.6851 1433.8055 1445.0521 1449.8618 1453.3021 1460.9498 1465.8011 1471.2894 1472.3783 1474.2836 1481.2193 1494.8375 1510.9765 1574.4823 1589.0420 1603.9482 1611.3739 1644.1986 1696.5875 2964.2790 2980.0880 2983.7355 3000.8447 3006.3349 3056.2501 3066.8729 3068.2925 3084.4342 3094.6618 3097.7817 3103.9836 3106.6906 3118.8279 3121.4106 3142.8945 3145.0138 3167.5151 3180.0091 3525.0770
redmass: 3.6321 4.4705 2.3920 3.2120 3.1670 5.3041 3.8256 3.2972 2.7368 2.9075 3.0720 5.2569 3.2933 1.2676 1.9972 2.8171 3.7197 2.0658 1.1462 3.7918 4.9608 4.1757 3.5843 3.7544 4.4597 3.6004 5.0912 3.5638 4.8897 3.6419 4.6783 4.4544 5.2383 4.5841 3.3394 4.7001 3.7607 4.2888 1.8546 2.0184 5.9699 4.1701 4.8841 4.8113 5.5658 3.5990 1.8399 1.2750 4.1296 4.0710 3.3993 4.7456 5.5051 1.4445 1.3895 1.5922 2.7245 2.1698 2.0566 2.2648 2.2992 2.4596 1.6568 1.4689 1.8484 2.0624 4.1562 1.2411 1.7233 2.7331 1.5056 2.1587 2.3081 1.2947 1.5548 1.4205 1.7285 2.6255 2.6930 1.4284 2.9757 3.5433 4.7134 1.2518 1.2131 2.0041 1.3844 2.6103 1.5388 2.1185 1.0640 1.0486 1.0544 1.0589 1.0455 1.0802 1.0568 1.0705 1.0871 4.5948 7.5841 6.7668 7.4272 6.1491 7.5980 10.5576 1.0310 1.0357 1.0406 1.0680 1.0374 1.1044 1.0981 1.0923 1.0960 1.0967 1.0983 1.0886 1.0994 1.1016 1.0881 1.1011 1.0901 1.0981 1.0919 1.0640
irintensity: 3.3800 0.5805 1.2626 1.7940 0.1297 0.7382 1.6022 1.0000 1.8162 0.3035 1.5811 3.7055 0.0071 0.1808 2.2734 0.6431 0.6679 1.2638 0.1003 2.2783 0.9609 4.4260 1.2385 2.7934 4.9987 7.3509 6.3966 5.7657 1.5008 5.4006 3.6097 8.5161 7.0949 16.8564 3.3222 21.4993 1.6133 2.0009 80.2775 69.5554 1.8296 36.1002 3.4755 17.1766 42.1894 36.2659 30.5285 6.4142 9.5537 54.6724 32.7685 3.1961 12.1586 25.0841 2.5654 34.3964 18.7648 165.5715 28.0749 50.8555 12.8558 684.8667 14.7873 0.8507 24.5930 4.7861 43.5040 1.5864 20.6133 56.9043 76.8808 332.5997 52.0683 1.6736 21.9487 5.5758 9.7155 95.9911 63.8737 3.2697 121.3879 26.6527 11.9126 62.1856 11.2394 2.0024 24.2078 20.5700 7.6120 22.7794 15.6428 16.7113 13.2180 16.7554 7.1760 19.9156 13.3949 11.5436 15.3800 2.8647 88.2861 26.6814 283.9155 9.0678 44.3715 139.5183 65.1676 44.4865 13.3194 41.4188 1.5959 33.9936 16.9693 14.0700 38.6412 5.4402 22.0799 1.0406 9.2038 27.1065 16.1738 9.5094 14.8250 18.0517 1.6177 55.7244
temp: 298.150 k
press: 1.00000 atm
elementType: 8 8 8 8 8 6 6 6 6 6 6 6 6 6 6 6 6 6 6 6 6 6 6 6 1 1 1 1 1 1 1 1 1 1 1 1 1 1 1 1 1 1 1 1
symmnumber: 1
zpe: 905680.1 jmol-1
zpe.correction: 0.344955 hartree
zpe.thermalcorrener: 0.369589 hartree
zpe.thermalcorrenthalpy: 0.370533 hartree
zpe.thermalcorrgfe: 0.288013 hartree
zpe.sumelectzpe: -1110.383154 hartree
zpe.sumelectthermal: -1110.358520 hartree
zpe.sumelectthermalent: -1110.357576 hartree
zpe.sumelectthermalfe: -1110.440097 hartree
dipole: 2.5618 -1.1777 -4.1993
dipole: 5.0581
quadrupole: -120.4392 -128.3069 -150.5068
quadrupole: 3.2281 -1.9602 4.6937
quadrupole: 12.6451 4.7774 -17.4225 3.2281 -1.9602 4.6937
hfenergy: -1110.7281096 hartree
pointgroup: C01 [X(C19H20O5)]
dipole: -1.0275625 0.1885726 -1.6937102 debye
polarizability: 363.6747271|14.7643514|260.630359|4.7779836|-20.1576786|137.6244798 unknown
InChI: InChI=1S/C19H20O5/c1-5-13-7-6-8-15-14(9-11(2)19(21)22)10-16(23-4)18(17(13)15)24-12(3)20/h6-10,21H,5H2,1-4H3
charge 0 multiplicity 1
44 atoms
O  -2.867732 0.604862 -0.501324
O  -1.133477 2.735919 -0.456721
O  -3.044881 1.391833 1.710545
O  6.1992 0.955905 -0.161672
O  5.395296 -0.692498 1.257923
C  -0.984292 -1.033262 -0.227354
C  0.461058 -1.185239 -0.057594
C  -1.815762 -2.22333 -0.293452
C  1.332038 -0.021268 -0.003563
C  -1.478307 0.315397 -0.341033
C  -3.335154 -2.22017 -0.448866
C  1.019687 -2.50107 0.026137
C  -0.6169 1.423961 -0.349621
C  -1.198653 -3.479909 -0.190624
C  0.776555 1.257516 -0.16921
C  0.205734 -3.630521 -0.030074
C  2.763599 -0.179584 0.303331
C  -4.068516 -2.173796 0.920049
C  3.826521 0.546177 -0.184971
C  3.770189 1.618058 -1.252796
C  -3.543078 1.261246 0.583869
C  -1.518429 3.118669 -1.833412
C  5.156337 0.184209 0.387046
C  -4.905876 1.709021 0.114991
H  -3.670375 -1.381147 -1.077074
H  -3.627851 -3.152594 -0.968209
H  2.103267 -2.621003 0.111001
H  -1.828476 -4.375923 -0.249123
H  1.389713 2.158472 -0.092742
H  0.644343 -4.631951 0.033116
H  3.027966 -0.960719 1.030069
H  -3.810402 -3.058158 1.53069
H  -5.165184 -2.166476 0.776542
H  -3.787046 -1.279924 1.503124
H  3.818899 2.632277 -0.811573
H  4.636092 1.531502 -1.929259
H  2.841447 1.543783 -1.841987
H  -1.921387 4.13972 -1.753107
H  -2.288029 2.432196 -2.233835
H  -0.633385 3.115611 -2.498565
H  -4.795045 2.551386 -0.591215
H  -5.5058 2.036303 0.97617
H  -5.419598 0.892829 -0.420124
H  7.053495 0.66879 0.260098
