program: Gaussian 09
title: 000125465
version: EM64L-G09RevD.01
frameworkgroup: C1[X(C11H16O3)]
method: RPBEPBE
basis: SDD
operation: Freq
keyword: #pfreq=noraman
keyword: PBEPBE/SDD
title: #p freq=noraman PBEPBE/SDD
converged: NO YES NO NO
title: Mulliken charges:
elementType: O O O C C C C C C C C C C C H H H H H H H H H H H H H H H H
charge: -0.264393 -0.455475 -0.252246 -0.112740 -0.129712 -0.217961 -0.261323 -0.540802 -0.241811 -0.229637 -0.366415 -0.410756 0.290640 -0.755519 0.259300 0.252210 0.258226 0.238115 0.212414 0.252501 0.244261 0.241224 0.268972 0.240519 0.199632 0.201077 0.346541 0.243235 0.246335 0.243587
chargesum: 0.00000
title: Mulliken charges with hydrogens summed into heavy atoms:
elementType: O O O C C C C C C C C C C C
charge: -0.264393 -0.108933 -0.252246 0.146560 0.122499 0.040264 -0.023209 -0.075887 0.002450 0.011588 0.143077 -0.010047 0.290640 -0.022362
polarizability: 1.41415029e+02 4.22930784e+00 1.14332188e+02 2.46449428e+00 -3.18899244e-01 1.05715642e+02
1716.lowfreq: -21.6765 -6.2431 -0.0010 -0.0004 -0.0004 11.6806 18.1997 20.8657 46.2077
frequency: -21.5014 20.1090 45.6211 81.7432 94.8154 110.5516 162.9679 178.2511 227.5865 256.5126 275.4161 281.9695 356.0784 423.3457 441.7810 469.7781 486.6867 545.4575 565.2292 623.1275 652.0632 723.7872 755.4632 787.1237 800.4850 841.3691 888.4225 905.0250 911.6618 925.2562 929.6028 944.2290 959.7187 966.6572 990.0035 1000.8291 1002.3526 1025.7095 1040.3769 1054.9701 1074.6353 1086.7329 1105.8073 1131.7551 1162.8221 1180.6367 1194.7899 1196.7996 1208.1971 1218.7499 1233.8422 1256.9691 1260.1098 1276.7068 1284.4692 1309.5037 1332.8244 1350.3955 1369.6664 1380.1350 1404.9409 1453.4049 1455.4463 1471.5547 1473.2919 1480.9778 1580.4100 1647.0467 2932.1046 2981.2346 3005.7848 3006.2874 3010.9226 3012.9349 3022.8159 3066.6305 3083.1259 3086.5107 3095.0192 3097.3061 3140.8184 3153.7565 3186.8860 3569.6564
redmass: 1.0737 8.4173 3.5535 3.6458 4.5403 4.2729 4.1347 3.0951 3.8607 1.7814 3.3719 1.3904 4.0497 3.1903 2.8103 3.0764 2.0486 3.2408 2.9901 3.7770 3.5950 1.5728 3.7412 4.0435 3.0414 4.4234 2.2591 2.1618 2.4526 1.6810 3.1886 2.6311 4.2550 1.8641 1.5680 1.9970 2.1427 1.6173 1.6692 1.7846 2.1068 1.2517 1.3285 1.6441 1.4365 1.7241 1.1388 1.2195 3.4252 1.4668 1.3178 1.3679 1.4443 1.5153 1.3616 1.4742 1.5643 1.3339 1.5214 1.2997 1.4350 1.0640 1.0479 1.0910 1.0788 1.0954 5.7344 9.1822 1.0543 1.1031 1.0642 1.0368 1.0613 1.0842 1.0830 1.0894 1.1069 1.1037 1.0974 1.0914 1.1010 1.0873 1.1095 1.0666
irintensity: 1.3250 0.6120 1.4624 1.8060 1.5359 2.7370 5.0563 7.3041 17.4813 53.8362 13.6023 80.1951 3.8328 4.7358 1.3441 6.1439 1.2823 14.4114 2.6569 5.9889 2.9273 74.8261 0.4943 3.9687 20.6546 4.4430 11.2150 3.7467 11.3363 1.1937 36.7256 12.4055 37.3705 5.7648 2.0707 43.9852 86.1388 8.7370 10.6155 11.1341 5.8555 8.8693 10.1646 6.5952 6.1259 0.9746 1.6539 35.8434 374.4255 7.6140 14.2822 2.3244 3.5409 4.7049 7.5670 8.2774 6.9420 1.1210 3.6143 50.1943 2.0234 27.5199 17.6642 7.7717 10.9211 9.7624 2.1906 205.4905 68.2569 35.0676 35.8960 4.3096 4.3717 8.0693 67.6949 57.0714 4.2425 49.8196 9.5894 23.0460 12.6064 6.8608 18.2968 2.2953
temp: 298.150 k
press: 1.00000 atm
elementType: 8 8 8 6 6 6 6 6 6 6 6 6 6 6 1 1 1 1 1 1 1 1 1 1 1 1 1 1 1 1
symmnumber: 1
zpe: 656669.4 jmol-1
zpe.correction: 0.250112 hartree
zpe.thermalcorrener: 0.263449 hartree
zpe.thermalcorrenthalpy: 0.264393 hartree
zpe.thermalcorrgfe: 0.208700 hartree
zpe.sumelectzpe: -653.313200 hartree
zpe.sumelectthermal: -653.299863 hartree
zpe.sumelectthermalent: -653.298919 hartree
zpe.sumelectthermalfe: -653.354612 hartree
dipole: 3.0489 0.2783 -2.3742
dipole: 3.8743
quadrupole: -77.2947 -79.0687 -85.6500
quadrupole: 9.8301 8.4473 -4.2346
quadrupole: 3.3764 1.6024 -4.9788 9.8301 8.4473 -4.2346
hfenergy: -653.5633122 hartree
pointgroup: C01 [X(C11H16O3)]
dipole: -1.1942141 0.1444018 0.9361668 debye
polarizability: 140.8868722|-5.6972803|114.8305694|2.3873091|0.4479679|105.7454171 unknown
InChI: InChI=1S/C11H16O3/c1-7(13)14-6-11-9-3-2-8(4-9)10(11)5-12/h2-3,8-12H,4-6H2,1H3
charge 0 multiplicity 1
30 atoms
O  2.022859 0.014243 0.496704
O  -1.282319 3.034423 0.138825
O  3.476554 0.352096 -1.295095
C  -0.398229 0.240362 0.435049
C  -1.6763 0.70744 -0.357245
C  -0.724614 -1.270346 0.781118
C  -2.623226 -0.561949 -0.261429
C  -2.236524 -1.125188 1.14408
C  -0.835066 -2.041628 -0.540234
C  -1.975395 -1.621433 -1.16362
C  0.881675 0.479904 -0.356092
C  -2.310065 1.978049 0.216865
C  3.281982 0.007344 -0.106925
C  4.336652 -0.463482 0.874267
H  -0.32825 0.806245 1.382994
H  -1.428685 0.91228 -1.41602
H  -0.057062 -1.699243 1.541973
H  -3.687838 -0.350129 -0.450235
H  -2.422374 -0.420958 1.976638
H  -2.720127 -2.092585 1.359718
H  -0.079633 -2.727713 -0.932774
H  -2.326953 -1.888884 -2.163907
H  1.021346 1.553614 -0.572776
H  0.899135 -0.082842 -1.307077
H  -2.624562 1.815934 1.270804
H  -3.204137 2.258615 -0.381084
H  -1.656936 3.889465 0.467981
H  4.063355 -1.449684 1.287017
H  4.404302 0.240461 1.722176
H  5.310834 -0.525512 0.368305
