program: Gaussian 09
title: 000125456
version: EM64L-G09RevD.01
frameworkgroup: C1[X(C14H13NO2)]
method: RPBEPBE
basis: SDD
operation: Freq
keyword: #p
keyword: freq=noraman
keyword: PBEPBE/SDD
title: #p freq=noraman PBEPBE/SDD
converged: YES YES NO NO
title: Mulliken charges:
elementType: O O N C C C C C C C C C C C C C C H H H H H H H H H H H H H
charge: -0.248606 -0.248481 -0.295980 0.020761 0.152890 0.312683 0.392415 -0.499066 0.408007 0.182541 0.097333 -0.403996 -0.517110 -0.389153 -0.767223 -0.812246 -0.525092 0.255254 0.242853 0.246675 0.249625 0.217795 0.256167 0.256237 0.238774 0.237364 0.236841 0.241685 0.230417 0.230637
chargesum: 0.00000
title: Mulliken charges with hydrogens summed into heavy atoms:
elementType: O O N C C C C C C C C C C C C C C
charge: -0.248606 -0.248481 -0.295980 0.020761 0.152890 0.312683 0.392415 -0.243812 0.408007 0.182541 0.097333 -0.161143 -0.270436 -0.139529 -0.037024 -0.099266 0.177647
polarizability: 2.44145653e+02 1.39153048e+01 2.08458163e+02 6.34220457e-02 3.49157378e-02 7.80177601e+01
1716.lowfreq: -8.0337 -5.8008 -0.0008 -0.0007 -0.0004 1.4411 57.0419 79.8662 118.1692
frequency: 57.0368 79.8659 118.1670 137.4234 142.7610 161.7048 185.5111 188.9257 233.7182 234.3186 262.0559 268.8525 316.7829 328.3717 336.8908 388.1836 428.0985 445.4995 499.9212 504.4464 540.5575 602.4238 623.6714 625.1894 628.4494 634.0816 655.7551 707.8547 718.4800 770.4552 807.9201 818.3363 819.2104 873.9578 947.6749 952.5756 967.7946 1006.5389 1011.2786 1044.0146 1047.9175 1049.6459 1092.9552 1113.4928 1137.6577 1158.9416 1174.1814 1207.3420 1240.0762 1253.4680 1265.1124 1305.6841 1324.7753 1384.9999 1398.4731 1403.2560 1413.3628 1436.1219 1449.8495 1451.4782 1457.9172 1465.3279 1467.3517 1468.9303 1474.5871 1497.6441 1553.7413 1566.4427 1593.8428 1599.6497 1646.0520 2977.0378 2979.5341 2993.5296 3055.8555 3074.8318 3076.2483 3097.5386 3099.1986 3129.3526 3147.8781 3166.1756 3172.5080 3235.2320
redmass: 3.2079 4.7010 5.2563 1.6943 1.4595 1.2860 3.4550 2.3626 1.6222 3.1258 3.3178 1.8577 5.0185 4.9831 4.8820 5.9394 4.8250 5.8970 3.9893 5.6622 4.8938 4.0270 4.9439 4.4453 4.8367 3.7673 5.7269 3.7636 4.2177 4.6968 1.4978 1.4995 6.1494 1.4309 1.3244 4.2218 6.5441 1.6386 1.5859 1.5624 1.4936 4.3975 2.6795 1.2494 2.2166 1.4189 1.5935 3.5205 2.2258 2.5135 2.1027 4.3556 4.1665 2.1839 1.7166 3.8599 1.2616 1.2912 1.0434 1.9696 1.9686 1.0465 1.0518 1.1442 1.0634 3.2577 6.4510 5.4735 7.6313 8.8652 8.4008 1.0315 1.0378 1.0364 1.0970 1.1048 1.0969 1.1007 1.0985 1.1011 1.0879 1.0916 1.0955 1.0968
irintensity: 1.6996 9.3755 0.4107 3.6930 0.6638 0.4677 2.3118 0.0121 1.7701 1.7531 4.6794 1.2214 1.9558 1.7721 0.6582 0.1515 3.2504 32.8096 2.9754 0.8176 1.2660 1.6364 4.8872 0.8901 3.1435 0.1355 0.9803 0.0036 4.0156 8.9723 21.9595 37.7609 11.7727 34.2618 0.0107 5.1391 20.8168 3.4472 11.6598 7.5829 5.8097 13.3571 34.2257 0.0278 0.9690 13.5496 28.5875 6.0356 205.7309 3.9197 69.5347 186.9576 17.3048 86.5124 69.6769 16.3693 22.7856 4.3303 14.1794 5.7705 19.6311 15.0938 15.3127 5.3220 28.9418 14.2278 81.7205 56.5312 484.8344 28.8290 144.5117 49.3710 18.0732 18.8690 15.0371 34.0741 10.5950 18.1442 20.8192 29.2842 5.2428 4.2359 9.4884 6.2096
temp: 298.150 k
press: 1.00000 atm
elementType: 8 8 7 6 6 6 6 6 6 6 6 6 6 6 6 6 6 1 1 1 1 1 1 1 1 1 1 1 1 1
symmnumber: 1
zpe: 618349.4 jmol-1
zpe.correction: 0.235517 hartree
zpe.thermalcorrener: 0.250409 hartree
zpe.thermalcorrenthalpy: 0.251353 hartree
zpe.thermalcorrgfe: 0.194417 hartree
zpe.sumelectzpe: -745.306025 hartree
zpe.sumelectthermal: -745.291133 hartree
zpe.sumelectthermalent: -745.290189 hartree
zpe.sumelectthermalfe: -745.347125 hartree
dipole: -3.2629 -1.3858 0.0080
dipole: 3.5450
quadrupole: -96.5585 -90.0258 -102.3868
quadrupole: -19.2201 -0.0916 -0.0142
quadrupole: -0.2348 6.2979 -6.0631 -19.2201 -0.0916 -0.0142
hfenergy: -745.5415421 hartree
pointgroup: C01 [X(C14H13N1O2)]
dipole: 1.3507353 -0.3445799 -0.0448902 debye
polarizability: 247.2033903|-8.2126938|204.7751403|-6.9632354|-6.2042474|78.6430449 unknown
InChI: InChI=1S/C14H13NO2/c1-8-6-13(16)15-9(2)7-11-12(17-3)5-4-10(8)14(11)15/h4-7H,1-3H3
charge 0 multiplicity 1
30 atoms
O  3.721576 -0.269051 -0.262295
O  -3.251891 1.458504 -0.050247
N  -0.977156 0.81527 -0.112133
C  -0.027001 -0.209152 -0.100496
C  1.279511 0.361115 -0.186675
C  -0.346028 -1.580576 -0.017009
C  -0.296034 2.068887 -0.205715
C  1.069553 1.807846 -0.251346
C  -1.759623 -1.927011 0.061163
C  2.360232 -0.56793 -0.186931
C  -2.385964 0.530428 -0.038705
C  0.770052 -2.466602 -0.01969
C  -2.696645 -0.901326 0.047734
C  2.081912 -1.965449 -0.102627
C  -1.011366 3.385722 -0.241777
C  -2.185021 -3.376731 0.155826
C  4.146952 1.131335 -0.364376
H  1.821151 2.589555 -0.322969
H  0.614812 -3.548467 0.042539
H  -3.766942 -1.121278 0.104539
H  2.939844 -2.644325 -0.105572
H  -0.27369 4.203018 -0.312634
H  -1.703569 3.449465 -1.099616
H  -1.631444 3.536589 0.659218
H  -3.282336 -3.469427 0.197596
H  -1.765786 -3.856154 1.060668
H  -1.824584 -3.955975 -0.715114
H  5.244727 1.091399 -0.416472
H  3.835554 1.705996 0.526911
H  3.745604 1.601625 -1.280694
