program: Gaussian 09
title: 000125426
version: EM64L-G09RevD.01
frameworkgroup: C1[X(C11H18N2O7)]
method: RPBEPBE
basis: SDD
operation: Freq
keyword: #p
keyword: freq=noraman
keyword: PBEPBE/SDD
title: #p freq=noraman PBEPBE/SDD
converged: YES YES NO NO
title: Mulliken charges:
elementType: O O O O O O O N N C C C C C C C C C C C H H H H H H H H H H H H H H H H H H
charge: -0.282077 -0.454645 -0.494819 -0.496594 -0.245146 -0.406029 -0.238127 -0.425342 -0.551651 -0.082558 -0.150309 -0.159653 -0.138910 -0.083868 -0.320134 0.207544 -0.382453 0.244652 0.080534 -0.780739 0.253861 0.332286 0.247541 0.245734 0.244009 0.265697 0.321462 0.280782 0.282881 0.239044 0.221619 0.373373 0.378586 0.256030 0.257304 0.212623 0.361411 0.386081
chargesum: 0.00000
title: Mulliken charges with hydrogens summed into heavy atoms:
elementType: O O O O O O O N N C C C C C C C C C C C
charge: -0.282077 -0.081272 -0.116233 -0.135183 -0.245146 -0.019948 -0.238127 -0.103880 0.012012 0.171303 0.181977 0.087888 0.106823 0.160141 -0.054437 0.207544 0.078209 0.244652 0.080534 -0.054781
polarizability: 1.75163790e+02 1.16731645e+01 1.71929489e+02 1.54326955e+01 4.59030453e+00 1.32059467e+02
1716.lowfreq: -7.4739 -3.3459 -0.0008 -0.0008 -0.0005 8.8406 20.9040 38.0713 43.2019
frequency: 20.7611 38.0184 43.1946 48.4972 58.4298 60.2342 73.2261 83.0291 101.0816 118.5152 128.4080 156.8125 174.1861 189.3850 212.4017 235.1292 236.7499 247.9811 276.9779 288.4337 299.0872 323.1116 371.5629 391.6119 411.5815 446.0015 476.6148 489.7929 494.4043 506.6997 518.2507 544.5190 556.5539 566.1471 586.4765 601.4289 607.7038 623.4312 656.9625 701.3690 723.9453 735.3761 822.2893 844.6599 863.3141 872.8955 881.0836 925.6963 947.5637 969.5417 976.2029 1001.6885 1010.5494 1024.3378 1038.7470 1050.1994 1059.0475 1067.6254 1075.9104 1105.7099 1115.1649 1156.5555 1164.9568 1188.3688 1197.7256 1231.1372 1236.2434 1244.0207 1256.0982 1262.8859 1280.1024 1294.7071 1304.1210 1313.2035 1331.6075 1342.5865 1350.1592 1357.9207 1363.7938 1385.7411 1404.9906 1418.3015 1449.5325 1465.0148 1471.4696 1472.3244 1610.9437 1619.1272 1630.0542 1633.4345 2974.8148 2979.5452 2981.7270 2995.9948 3003.1335 3022.6475 3054.0753 3067.1211 3097.2609 3100.4963 3155.8811 3479.5757 3488.8356 3495.7743 3514.9808 3531.4899 3607.8409 3614.9087
redmass: 5.4449 5.1500 5.9353 7.6403 2.9724 1.9240 3.5376 2.4370 4.3020 4.5001 4.3788 5.2285 4.0158 5.3355 7.9174 1.5851 1.4011 1.6672 4.3920 3.9008 4.7360 5.1223 4.9992 3.5278 3.9513 4.6988 2.9214 1.4615 1.7007 2.0219 2.4721 1.5444 1.9770 2.6952 4.1450 3.9969 1.7780 1.3649 3.8727 2.6680 5.8414 5.2800 3.1815 2.1878 3.8374 3.6442 2.7757 3.2552 4.5450 6.5713 2.0287 3.3397 3.4582 3.1527 1.6433 2.3400 1.9833 1.9140 1.9208 1.9174 2.1986 1.8871 1.7816 1.5644 1.1338 1.6544 1.2770 1.2813 1.4132 1.4996 1.4192 1.2835 1.5572 1.2715 1.2700 1.5039 1.7131 1.6804 1.5404 1.2244 1.6186 1.9350 1.0469 1.2926 1.0774 1.4369 3.1031 1.5885 8.5600 4.4891 1.0571 1.0823 1.0831 1.0361 1.0848 1.0868 1.1064 1.0857 1.0995 1.0992 1.0916 1.0444 1.0646 1.0645 1.0641 1.0770 1.0671 1.0995
irintensity: 1.3822 0.7372 0.3817 2.1307 11.3656 1.3145 1.4612 3.8094 2.5309 6.5064 1.5199 10.4292 0.6774 16.8321 1.7666 79.9038 60.2817 84.2054 14.9862 14.0761 2.8517 7.9719 3.9038 7.0008 14.4020 8.0537 44.6171 8.3722 249.4451 68.0754 17.1015 125.0090 79.4086 68.1643 2.5469 27.4742 26.7217 137.7648 82.9027 9.8898 22.1736 8.8298 2.8411 52.5389 19.5976 19.7695 22.6628 12.8485 5.9426 68.4326 67.9978 39.0114 35.2796 102.4741 8.9656 129.0739 1.9423 16.0559 33.7332 168.7199 47.0995 6.2617 72.1746 13.9902 29.1222 30.2337 14.9100 4.3876 52.8022 98.0769 33.8195 22.3408 83.1504 21.0953 3.7619 39.2403 62.9047 52.2435 7.5527 69.0958 16.5463 18.1172 15.7795 181.9621 8.4044 106.8736 135.0257 15.5727 266.5269 107.5995 32.9355 16.9897 4.6889 9.5841 45.1194 23.0452 43.5623 12.8859 14.3371 12.3759 0.3812 8.5837 73.8874 22.2566 44.3237 15.5459 11.0454 7.8433
temp: 298.150 k
press: 1.00000 atm
elementType: 8 8 8 8 8 8 8 7 7 6 6 6 6 6 6 6 6 6 6 6 1 1 1 1 1 1 1 1 1 1 1 1 1 1 1 1 1 1
symmnumber: 1
zpe: 781637.2 jmol-1
zpe.correction: 0.297710 hartree
zpe.thermalcorrener: 0.319914 hartree
zpe.thermalcorrenthalpy: 0.320858 hartree
zpe.thermalcorrgfe: 0.244724 hartree
zpe.sumelectzpe: -1064.441805 hartree
zpe.sumelectthermal: -1064.419601 hartree
zpe.sumelectthermalent: -1064.418656 hartree
zpe.sumelectthermalfe: -1064.494790 hartree
dipole: 2.1750 4.1166 0.6082
dipole: 4.6954
quadrupole: -103.0383 -138.5300 -110.0973
quadrupole: -2.2133 -11.3376 -6.2847
quadrupole: 14.1836 -21.3081 7.1245 -2.2133 -11.3376 -6.2847
hfenergy: -1064.7395145 hartree
pointgroup: C01 [X(C11H18N2O7)]
dipole: 0.645709 1.7161516 0.2245806 debye
polarizability: 172.3412159|11.8355047|174.9872834|14.4427206|6.1558948|131.8242464 unknown
InChI: InChI=1S/C11H18N2O7/c1-4(15)13-8-5(12)2-7(11(18)19)20-10(8)9(17)6(16)3-14/h2,5-6,8-10,13-14,16-18H,3,12H2,1H3
charge 0 multiplicity 1
38 atoms
O  0.35722 0.936389 0.192919
O  1.592433 -2.141453 -1.356974
O  3.476629 -1.881373 0.567476
O  4.754616 0.322456 -0.12015
O  -2.223135 -3.287638 -0.029264
O  0.829728 3.30926 1.22573
O  -1.153491 4.227515 0.429843
N  -1.657655 -1.080562 0.481131
N  -3.405478 0.000655 -1.501812
C  0.321846 -0.2355 -0.740522
C  -1.128442 -0.758374 -0.852575
C  1.321048 -1.268215 -0.210713
C  -1.979515 0.335228 -1.570986
C  2.644628 -0.685315 0.330487
C  -1.646833 1.708348 -0.97593
C  -0.593139 1.92489 -0.131104
C  3.372934 0.250414 -0.647102
C  -2.145253 -2.347336 0.811585
C  -0.371138 3.24872 0.511652
C  -2.578343 -2.512102 2.267075
H  0.657868 0.117449 -1.736647
H  -1.150723 -1.694197 -1.436666
H  0.863231 -1.851872 0.614604
H  -1.686898 0.323799 -2.640277
H  2.46299 -0.151384 1.281882
H  -2.31404 2.551039 -1.186701
H  -1.522299 -0.391641 1.225367
H  -4.025591 0.566033 -2.085526
H  -3.755822 -0.163013 -0.554484
H  2.894296 1.247319 -0.639944
H  3.368503 -0.181549 -1.668406
H  2.338533 -2.731876 -1.062846
H  4.417187 -1.556196 0.606311
H  -3.62784 -2.851736 2.29306
H  -1.969357 -3.305007 2.734934
H  -2.485118 -1.589795 2.866482
H  5.324906 0.86095 -0.719958
H  0.909416 4.216772 1.628348
