program: Gaussian 09
title: 000125368
version: EM64L-G09RevD.01
frameworkgroup: C1[X(C18H19N3O)]
method: RPBEPBE
basis: SDD
operation: Freq
keyword: #p
keyword: freq=noraman
keyword: PBEPBE/SDD
title: #p freq=noraman PBEPBE/SDD
converged: YES YES NO NO
title: Mulliken charges:
elementType: O N N N C C C C C C C C C C C C C C C C C C H H H H H H H H H H H H H H H H H H H
charge: -0.243797 -0.320603 -0.109230 -0.382326 -0.128969 -0.490696 -0.531718 0.325331 0.091433 -0.541674 0.068537 0.231894 0.170707 0.102584 -0.812420 -0.332852 -0.417960 0.170948 -0.229810 -0.245114 -0.771690 -0.252296 0.245675 0.207816 0.302323 0.233131 0.222845 0.222045 0.251080 0.233163 0.236482 0.227054 0.297228 0.236028 0.223077 0.220852 0.304794 0.257186 0.236972 0.233505 0.258461
chargesum: 0.00000
title: Mulliken charges with hydrogens summed into heavy atoms:
elementType: O N N N C C C C C C C C C C C C C C C C C C
charge: -0.243797 -0.320603 -0.109230 -0.077531 0.116705 0.019443 -0.075742 0.325331 0.091433 -0.068549 0.068537 0.231894 0.170707 0.102584 -0.115720 -0.035624 -0.181932 0.170948 -0.006734 -0.024262 -0.044026 0.006166
polarizability: 3.11509122e+02 -9.07074065e+00 2.31891972e+02 5.04660104e+00 -1.48949395e+00 1.15105010e+02
1716.lowfreq: -0.0008 -0.0005 -0.0005 2.8566 6.4941 8.5299 17.4385 25.2663 44.5226
frequency: 17.3635 25.1270 44.5095 83.3820 85.5462 101.4346 110.9814 129.4178 152.4943 155.1027 187.9003 210.9185 230.4071 239.6905 256.6592 290.0155 306.9577 343.3058 365.0754 378.9335 402.3619 425.8891 442.0362 502.1836 518.0483 542.8003 573.8578 597.7811 615.7604 620.2026 626.0315 647.9205 656.7746 659.8710 689.5636 707.0614 761.6022 765.4118 770.1700 772.3667 812.2486 832.6010 836.9197 874.6830 901.0023 920.3978 949.1118 951.7968 961.7954 985.5805 986.0129 1012.3955 1027.1557 1031.8625 1043.0125 1044.9494 1057.5457 1073.3989 1096.3195 1105.0318 1115.7196 1137.8375 1158.4470 1166.4318 1189.4667 1206.3047 1227.3666 1237.3084 1249.3206 1255.3446 1272.0941 1299.2479 1304.7256 1317.5780 1328.4823 1330.3505 1337.2126 1361.9402 1377.9096 1405.0248 1407.3402 1409.2022 1410.7849 1449.5647 1452.2590 1460.6429 1466.2726 1466.7675 1469.2002 1471.9644 1476.8455 1480.5475 1486.5569 1583.6513 1591.6202 1595.6971 1615.3471 1637.8928 2945.1148 2953.6329 2969.6765 2971.2906 2982.5491 2991.1185 3039.7403 3040.4711 3041.9759 3062.5446 3074.7910 3082.1659 3096.1126 3125.2456 3140.0434 3158.2451 3200.7181 3234.1865 3583.6493
redmass: 4.1019 5.3974 4.2447 3.4624 4.0202 1.1497 1.0444 4.6978 3.7130 4.4840 3.7768 2.8502 2.9830 2.6404 5.8478 3.8947 2.5088 4.1934 3.4338 3.6468 3.9232 4.5169 3.1628 4.2873 4.1656 4.5811 4.1427 4.5000 4.1659 2.6402 4.1676 1.3222 4.8240 4.3319 4.0939 5.0193 2.2382 2.0377 2.6346 1.5301 3.4154 2.3773 3.1673 1.4097 2.0408 5.4014 3.1328 1.3765 1.7738 1.2973 2.4953 2.1281 2.7699 1.8416 1.5311 1.4867 2.3078 2.0141 2.3259 1.7765 1.6300 2.2878 1.6052 1.2426 2.0134 1.5304 1.8069 1.5407 2.1866 2.2652 1.5202 1.6050 1.8147 1.6229 2.2043 2.1902 1.6250 2.4870 3.0146 1.5569 2.0328 1.9784 4.3257 2.2504 2.9297 1.1078 1.2752 1.6383 1.1431 1.0505 1.1889 1.2396 1.0896 9.1715 7.5457 6.2900 7.7736 8.6046 1.0798 1.0685 1.0379 1.0390 1.0659 1.0650 1.0929 1.0968 1.0987 1.0947 1.0992 1.0971 1.0956 1.0854 1.0916 1.0982 1.0951 1.0984 1.0818
irintensity: 4.0846 1.1333 3.9977 0.3581 2.5318 0.1840 0.6520 1.1147 0.6408 3.0212 0.6333 0.9752 0.3882 0.6007 8.0105 9.8705 6.0877 1.3617 9.5845 0.5231 4.5609 4.7694 3.4694 17.0547 1.9074 5.2699 2.9238 15.4130 6.0962 53.8649 9.0312 53.7184 0.4202 7.2231 3.2603 0.4623 20.7231 55.4039 37.7057 13.4217 5.4649 1.0640 1.1233 0.1641 7.7604 0.9447 41.3991 5.0025 0.9298 0.7930 1.2178 10.2545 15.3860 2.7660 2.0015 2.4054 16.8926 11.1072 36.5891 14.5773 12.2696 26.2654 19.5350 1.8651 67.8784 2.6150 31.7423 3.4048 6.3039 10.6420 5.4025 72.7361 7.9814 42.1388 141.7984 10.7750 8.0354 166.9273 5.6368 20.7269 10.9258 22.4491 13.1831 22.7681 128.8806 8.7469 10.1885 19.6877 15.9282 12.5760 16.8887 3.8622 14.3960 151.2285 32.9183 47.3864 3.0953 17.5683 5.0548 26.6351 48.5533 47.3658 8.7531 42.1475 36.1078 11.7314 23.1625 16.4242 6.6605 20.8575 12.1748 1.8631 21.0052 38.4983 3.8666 3.9428 37.4164
temp: 298.150 k
press: 1.00000 atm
elementType: 8 7 7 7 6 6 6 6 6 6 6 6 6 6 6 6 6 6 6 6 6 6 1 1 1 1 1 1 1 1 1 1 1 1 1 1 1 1 1 1 1
symmnumber: 1
zpe: 875787.8 jmol-1
zpe.correction: 0.333570 hartree
zpe.thermalcorrener: 0.352949 hartree
zpe.thermalcorrenthalpy: 0.353893 hartree
zpe.thermalcorrgfe: 0.284317 hartree
zpe.sumelectzpe: -935.262665 hartree
zpe.sumelectthermal: -935.243286 hartree
zpe.sumelectthermalent: -935.242342 hartree
zpe.sumelectthermalfe: -935.311918 hartree
dipole: -4.0671 1.4824 -1.8845
dipole: 4.7213
quadrupole: -89.3301 -125.0468 -132.2129
quadrupole: 9.8272 9.3114 -0.9037
quadrupole: 26.1998 -9.5169 -16.6829 9.8272 9.3114 -0.9037
hfenergy: -935.5962348 hartree
pointgroup: C01 [X(C18H19N3O1)]
dipole: -1.6085771 0.5316087 -0.7616691 debye
polarizability: 311.8441884|-5.3615512|231.1113487|9.8146665|3.1288017|115.5505676 unknown
InChI: InChI=1S/C18H19N3O/c1-11-14-5-3-4-6-17(14)21-16(11)8-7-13(18(21)22)9-15-12(2)19-10-20-15/h3-6,10,13,19H,7-9H2,1-2H3
charge 0 multiplicity 1
41 atoms
O  0.125173 -1.986266 0.077029
N  1.333768 0.002788 -0.028938
N  -4.145753 1.111998 0.241432
N  -5.751578 -0.121058 -0.74688
C  -1.163309 0.119844 -0.02287
C  -0.964182 1.519738 0.60864
C  0.189524 2.268607 -0.093042
C  1.444373 1.437886 -0.090537
C  0.12495 -0.722736 0.023385
C  -2.345541 -0.666846 0.609126
C  2.783388 1.790591 -0.138762
C  2.650316 -0.547333 -0.04184
C  3.563496 0.554288 -0.110782
C  -3.697844 -0.225447 0.115247
C  3.355901 3.180966 -0.208957
C  3.087111 -1.885597 0.001242
C  4.955954 0.304704 -0.137275
C  -4.686811 -1.008424 -0.500537
C  4.483514 -2.111166 -0.027994
C  5.406909 -1.032878 -0.096285
C  -4.745531 -2.462598 -0.871276
C  -5.381232 1.137346 -0.287497
H  -1.387896 0.264198 -1.103446
H  -0.738875 1.402689 1.687595
H  -1.913553 2.074686 0.527662
H  0.385479 3.23859 0.398656
H  -0.115454 2.501532 -1.135563
H  -2.286848 -0.551591 1.709921
H  -2.197876 -1.740294 0.398257
H  4.080793 3.357564 0.608629
H  3.896844 3.346537 -1.160869
H  2.570093 3.952028 -0.135187
H  2.370395 -2.706234 0.055403
H  5.671325 1.133048 -0.190002
H  4.858102 -3.14039 0.003411
H  6.48175 -1.245664 -0.117145
H  -6.637429 -0.36903 -1.185999
H  -3.779358 -2.944829 -0.651287
H  -5.524063 -3.007811 -0.303598
H  -4.94952 -2.609895 -1.949232
H  -6.025104 2.01106 -0.355437
