program: Gaussian 09
title: 000125321
version: EM64L-G09RevD.01
frameworkgroup: C1[X(C23H24O8)]
method: RPBEPBE
basis: SDD
operation: Freq
keyword: #pfreq=noraman
keyword: PBEPBE/SDD
title: #p freq=noraman PBEPBE/SDD
converged: YES YES NO NO
title: Mulliken charges:
elementType: O O O O O O O O C C C C C C C C C C C C C C C C C C C C C C C H H H H H H H H H H H H H H H H H H H H H H H H
charge: -0.243413 -0.276194 -0.235999 -0.447657 -0.239173 -0.459156 -0.301021 -0.295440 -0.035115 -0.152509 -0.063408 -0.539178 0.073413 0.068737 0.259452 -0.026264 0.441714 -0.079302 -0.375384 0.219514 0.180957 -0.363016 -0.397251 -0.369572 -0.562268 -0.718104 -0.539609 0.211084 0.243549 -0.528899 -0.530907 0.267298 0.235281 0.253132 0.255732 0.238464 0.238051 0.245351 0.280105 0.257628 0.235037 0.180971 0.376140 0.289249 0.224456 0.198710 0.269090 0.275182 0.348521 0.248254 0.222758 0.229360 0.258868 0.224287 0.228492
chargesum: 0.00000
title: Mulliken charges with hydrogens summed into heavy atoms:
elementType: O O O O O O O O C C C C C C C C C C C C C C C C C C C C C C C
charge: -0.243413 -0.276194 -0.235999 -0.071516 -0.239173 -0.110635 -0.301021 -0.295440 -0.035115 0.114789 0.171874 -0.030313 0.073413 0.068737 0.259452 -0.026264 0.441714 0.159162 0.108018 0.219514 0.180957 -0.082911 -0.139623 0.046435 -0.273018 -0.025849 -0.264427 0.211084 0.243549 0.171473 0.180741
polarizability: 3.45003240e+02 4.07832569e+00 2.51426239e+02 -3.41778585e+00 -1.04927175e+00 2.66746558e+02
1716.lowfreq: -7.6431 -6.1449 -0.0004 -0.0001 0.0005 4.3767 13.3849 27.6505 30.9155
frequency: 13.3833 27.5329 30.8297 41.3435 59.2561 67.5456 80.9052 96.6235 101.6068 105.4984 116.8103 125.4433 138.6814 157.3387 167.7334 170.8345 190.0110 205.3690 217.3752 219.5941 225.1200 233.9659 248.9623 254.5722 262.4151 269.5861 278.7771 296.8665 301.4488 321.0587 333.4071 346.3364 354.2692 370.5181 392.8677 427.0891 438.7790 454.5946 461.8472 478.4126 495.0434 498.4559 506.5493 519.8279 523.8495 591.0536 602.1527 614.3053 619.6887 643.3020 661.1440 680.5173 692.5846 710.7178 724.6486 736.7023 745.3524 770.0884 774.8729 799.3326 814.6857 825.7570 869.5127 874.0539 875.0318 890.0154 909.8608 917.8639 924.6385 935.1655 948.3808 950.4388 956.4230 972.0687 975.1294 978.5641 995.0633 1026.2157 1035.6685 1043.6614 1077.8134 1082.3398 1104.8472 1112.5606 1115.1464 1115.5360 1117.1096 1143.8334 1148.8572 1155.7415 1160.9952 1161.8917 1177.7421 1190.0730 1200.3977 1218.3314 1225.1912 1227.1770 1233.7508 1237.3220 1258.6616 1274.0498 1281.0835 1290.5504 1295.3049 1301.4301 1317.1388 1331.5635 1336.4411 1358.1929 1372.7214 1377.6115 1385.4272 1389.3841 1400.1312 1414.1129 1424.0888 1442.9421 1449.0648 1454.9069 1457.9815 1459.4096 1463.0251 1469.4073 1476.7407 1477.5959 1479.6984 1481.1158 1486.1674 1487.1687 1557.1094 1565.0352 1586.0546 1621.3902 1628.1842 2931.1390 2968.1972 2975.1682 2977.8659 2989.5196 2996.7664 3007.7418 3010.5126 3022.3710 3026.5166 3063.2289 3066.3217 3070.1208 3073.6534 3106.0164 3109.4913 3118.0880 3123.1494 3150.6764 3154.1226 3178.7251 3185.0466 3418.1571 3582.7996
redmass: 5.7738 5.7292 4.0082 3.5264 4.3917 3.7257 4.4271 4.5667 3.2446 3.7779 6.9381 5.1345 3.9483 1.1715 1.1202 3.5681 3.7937 1.0563 5.1798 5.4543 4.7447 4.5557 1.1184 4.3289 3.7120 2.8625 5.4968 6.3709 6.0317 4.9328 5.2891 4.8470 3.4882 3.8682 5.3397 4.8861 5.8505 3.8042 2.8088 1.9198 3.4653 3.0980 4.4930 4.7685 4.7095 5.5836 6.1563 6.1254 6.3430 6.0210 5.7622 4.8794 6.1100 7.4105 6.6242 4.0815 3.8520 5.5947 5.1618 3.2701 4.8190 1.5647 3.2805 3.8171 1.6693 5.8721 3.2135 1.5702 1.7439 2.2040 1.6804 3.2302 5.2181 2.0730 2.5369 3.1953 3.2507 2.9216 3.0026 3.5849 3.4224 2.0945 2.0592 1.5644 1.3850 1.6361 1.8594 1.7069 1.3659 1.4919 1.6756 1.7366 1.7499 3.8622 2.6811 1.1975 1.3539 1.2752 1.7661 1.2443 1.3691 3.7854 1.4615 1.5884 1.4748 1.6602 2.5829 2.2849 1.5301 1.5733 5.7749 1.4520 1.2854 3.2665 5.8291 1.3948 1.1906 1.2924 2.8945 1.2043 1.0610 1.0745 1.2096 1.1252 3.4897 1.0795 2.8955 1.0861 1.0671 1.0530 10.0611 10.4360 8.7709 7.4204 9.0851 1.0634 1.0307 1.0310 1.0396 1.0843 1.0646 1.0851 1.0698 1.0788 1.0985 1.1045 1.0984 1.0977 1.1036 1.1018 1.0982 1.1023 1.1032 1.0915 1.0896 1.0922 1.0963 1.0645 1.0667
irintensity: 0.1294 0.4454 0.5802 0.4815 1.5758 1.3475 1.9899 1.6992 12.0282 0.5589 2.2790 1.9977 5.1073 0.5705 0.4692 4.1840 7.9714 1.9808 4.4472 6.1671 0.6660 1.2824 143.5489 9.4984 23.0233 5.5226 4.9390 2.9814 2.2625 12.6073 16.3325 10.1810 7.6134 2.8480 0.0473 11.2688 11.1561 12.5845 57.8909 59.9350 8.7199 28.5448 12.6044 29.9363 1.6856 22.8036 15.6995 2.8676 13.1762 16.4154 14.9221 6.9088 1.2642 12.4057 35.8759 1.6875 1.9881 18.9283 6.8548 62.9473 10.3483 38.0645 2.9460 7.7343 13.2657 15.8275 5.4569 51.1469 20.5845 58.1576 21.5291 9.5531 110.0043 118.9935 130.1454 37.5434 50.1745 65.5297 18.1651 90.3079 94.2193 5.7642 30.6345 62.1655 17.1283 2.7492 21.2393 116.7110 8.5369 38.6865 27.1741 47.9713 2.2171 56.9974 27.4625 23.1976 24.7581 23.4723 113.6830 26.5304 4.0982 109.5868 42.3665 55.4949 96.9380 12.1308 244.2891 19.9445 5.2135 11.4001 10.5950 29.0536 21.0308 51.4389 106.2992 6.7812 2.5427 11.9701 26.4892 24.6471 14.8503 17.0531 13.8339 7.8123 50.4113 8.7458 217.1353 7.6478 10.4849 22.4186 41.9573 338.3491 48.0520 55.8603 326.4337 55.9896 63.8244 86.4403 22.5976 14.1813 13.5505 22.3510 5.0350 54.9472 54.4601 29.1982 9.0197 52.9145 22.9220 12.2608 12.7776 27.6459 22.9505 0.7326 0.2515 0.2834 3.9394 44.4282 4.5205
temp: 298.150 k
press: 1.00000 atm
elementType: 8 8 8 8 8 8 8 8 6 6 6 6 6 6 6 6 6 6 6 6 6 6 6 6 6 6 6 6 6 6 6 1 1 1 1 1 1 1 1 1 1 1 1 1 1 1 1 1 1 1 1 1 1 1 1
symmnumber: 1
zpe: 1124943.9 jmol-1
zpe.correction: 0.428469 hartree
zpe.thermalcorrener: 0.457689 hartree
zpe.thermalcorrenthalpy: 0.458634 hartree
zpe.thermalcorrgfe: 0.367961 hartree
zpe.sumelectzpe: -1490.304889 hartree
zpe.sumelectthermal: -1490.275668 hartree
zpe.sumelectthermalent: -1490.274724 hartree
zpe.sumelectthermalfe: -1490.365396 hartree
dipole: 4.0990 0.7298 0.0433
dipole: 4.1637
quadrupole: -157.1865 -181.8150 -177.3600
quadrupole: -13.5052 5.3181 15.0951
quadrupole: 14.9340 -9.6945 -5.2395 -13.5052 5.3181 15.0951
hfenergy: -1490.7333574 hartree
pointgroup: C01 [X(C23H24O8)]
dipole: -1.6027165 0.3190717 -0.1138587 debye
polarizability: 344.6230006|-7.8316503|253.8466|-1.3296889|5.2978033|264.7064355 unknown
InChI: InChI=1S/C23H24O8/c1-11(9-24)16-6-13-15(30-16)5-4-12-21(13)31-20-10-29-17-8-19(28-3)18(27-2)7-14(17)23(20,26)22(12)25/h4-5,7-8,11,16,20,24,26H,6,9-10H2,1-3H3
charge 0 multiplicity 1
55 atoms
O  -0.494834 -0.941366 1.718511
O  -4.272077 -0.324853 -1.045004
O  1.908833 0.245884 2.867131
O  2.614927 -2.981021 1.322351
O  1.48168 -3.316627 -1.114353
O  -6.877653 2.994864 -0.991119
O  4.188936 1.006454 -2.241744
O  4.397651 3.032404 -0.136842
C  1.654026 -1.95635 0.887789
C  0.684468 -1.778073 2.076885
C  -4.581417 0.280492 0.328376
C  -3.236121 0.237769 1.118832
C  -2.367331 -0.660177 0.261304
C  -1.095252 -1.201564 0.486036
C  -0.470914 -1.988818 -0.54048
C  0.884897 -2.493645 -0.345546
C  2.347454 -0.631239 0.573699
C  -5.196276 1.673591 0.132779
C  1.385608 -1.081567 3.235729
C  -3.015739 -0.915501 -0.966278
C  2.456567 0.370157 1.57819
C  -1.171326 -2.230118 -1.760192
C  -2.446939 -1.699553 -1.999462
C  -6.396446 1.612244 -0.829373
C  2.936074 -0.38053 -0.689355
C  -5.611637 2.268324 1.499753
C  3.146129 1.576016 1.325892
C  3.61225 0.820491 -0.959961
C  3.738555 1.802014 0.071029
C  3.54514 2.074512 -3.04148
C  5.835431 2.921884 -0.483683
H  0.323249 -2.77619 2.393254
H  -5.326319 -0.410684 0.770916
H  -3.373258 -0.151659 2.141575
H  -2.790878 1.246805 1.209796
H  -4.433472 2.331089 -0.32982
H  0.69175 -0.889623 4.068544
H  2.220798 -1.726487 3.569071
H  -0.665862 -2.840154 -2.516054
H  -2.986247 -1.875881 -2.932762
H  -6.076176 1.185106 -1.799495
H  -7.194355 0.96691 -0.39726
H  2.837755 -3.504643 0.499361
H  2.867334 -1.122789 -1.491568
H  -4.742635 2.405005 2.167702
H  -6.341502 1.611744 2.012696
H  -6.089184 3.248143 1.340356
H  3.239123 2.32931 2.11235
H  -7.565687 3.022032 -1.70114
H  3.594977 3.0459 -2.515994
H  2.489393 1.813329 -3.246514
H  4.110551 2.117875 -3.984979
H  5.978932 2.293184 -1.380072
H  6.395389 2.494895 0.369642
H  6.16876 3.953586 -0.672421
