program: Gaussian 09
title: 000125310
version: EM64L-G09RevD.01
frameworkgroup: C1[X(C22H32N2)]
method: RPBEPBE
basis: SDD
operation: Freq
keyword: #pfreq=noraman
keyword: PBEPBE/SDD
title: #p freq=noraman PBEPBE/SDD
converged: YES YES NO NO
title: Mulliken charges:
elementType: N N C C C C C C C C C C C C C C C C C C C C C C H H H H H H H H H H H H H H H H H H H H H H H H H H H H H H H H
charge: -0.319245 -0.319485 -0.389474 -0.388236 -0.034384 -0.033927 -0.367408 -0.368872 -0.576705 -0.576658 -0.751019 -0.751420 0.500634 0.500672 -0.424894 -0.424241 -0.397360 -0.397784 -0.229182 -0.229422 -0.232185 -0.232014 -0.244302 -0.244281 0.175131 0.214979 0.175010 0.215144 0.200730 0.200676 0.203670 0.176107 0.176726 0.203846 0.250571 0.250534 0.222060 0.215581 0.222201 0.215189 0.218724 0.244992 0.207428 0.218530 0.245253 0.207630 0.233745 0.233721 0.230133 0.230148 0.222831 0.222843 0.222170 0.222167 0.226360 0.226364
chargesum: 0.00000
title: Mulliken charges with hydrogens summed into heavy atoms:
elementType: N N C C C C C C C C C C C C C C C C C C C C C C
charge: -0.068675 -0.068951 0.000636 0.001918 0.166347 0.166749 0.012368 0.011699 -0.139064 -0.139268 -0.079875 -0.080006 0.500634 0.500672 -0.191149 -0.190519 -0.167227 -0.167637 -0.006351 -0.006580 -0.010015 -0.009846 -0.017942 -0.017917
polarizability: 3.52823471e+02 -1.53159502e+01 2.36389370e+02 1.18047081e-01 -2.48232891e-01 1.66208901e+02
1716.lowfreq: -13.2433 -0.0018 0.0012 0.0014 2.7849 6.0941 12.4590 15.1127 15.7202
frequency: 12.3972 14.9875 15.2626 23.8757 30.6397 38.9401 48.8962 63.0912 69.9943 85.7627 96.5514 98.4263 106.5604 141.8770 151.6005 178.3137 206.8499 225.2694 232.0212 243.7809 245.1255 313.7758 314.1425 348.4106 349.0720 383.6518 397.7765 404.8142 404.9868 427.0667 447.7546 488.8739 500.9764 504.8594 510.8603 593.7842 599.8222 617.2426 617.7461 625.5016 632.6284 705.6151 705.7823 743.3802 748.5387 748.8656 800.7454 820.6804 822.2307 841.7054 845.0073 852.6993 852.9384 885.8962 887.0270 913.4120 917.3663 921.3419 946.0283 951.5445 974.0976 974.3126 989.7027 989.7080 992.4171 992.5063 1016.7354 1026.8314 1026.9652 1036.6389 1042.6532 1047.9099 1064.8778 1070.0803 1080.7753 1097.6848 1098.3231 1101.4908 1133.9974 1142.8976 1151.6917 1170.9164 1170.9660 1178.4016 1186.4326 1186.6173 1198.8362 1206.6958 1208.0669 1219.1330 1222.6317 1242.3978 1250.0718 1273.9555 1275.3364 1279.8839 1283.5622 1306.6366 1321.4490 1323.8243 1330.3827 1336.7401 1338.4843 1343.7967 1373.0783 1375.3365 1381.4255 1381.4818 1384.5397 1384.6613 1438.5027 1438.5154 1457.0965 1457.7672 1464.6371 1465.3785 1466.6073 1472.4657 1477.4352 1477.4574 1479.7265 1479.8259 1483.4575 1483.6328 1492.5405 1495.9662 1591.0615 1591.0824 1613.4594 1613.5665 2835.4711 2836.3082 2847.4621 2848.8703 2955.7745 2957.7219 2974.6147 2974.6523 2991.5553 2991.9906 2997.9882 3000.4366 3020.8339 3047.5676 3052.7521 3053.3555 3064.3571 3064.5123 3093.7355 3093.8919 3111.5947 3111.6336 3115.4988 3115.5904 3130.0174 3130.0564 3141.2985 3141.3189 3160.2492 3160.2924 3430.2808 3430.7810
redmass: 3.8695 4.4128 4.2601 4.6112 3.8834 1.8057 3.3914 3.5835 2.8161 3.5466 3.9608 4.1130 1.9911 3.1113 2.5840 3.3753 1.7567 1.3276 2.4131 2.2800 1.9486 3.4670 3.7396 2.3248 2.3377 2.3853 2.2193 2.8234 2.8247 3.2680 2.8408 2.7532 2.8183 3.2750 2.7225 3.2891 2.4583 5.2033 5.9845 2.0484 1.7608 1.7938 1.7935 1.0969 1.8030 1.8739 1.1957 3.7575 3.3997 2.2441 2.2354 1.2533 1.2541 1.4009 1.3943 1.4688 1.4626 1.4273 1.7618 1.5326 1.3866 1.3863 6.1621 6.1804 1.3132 1.3123 4.2816 2.1872 2.1869 2.0088 1.5981 2.2745 3.3819 2.8695 2.1038 1.4796 1.5163 1.6380 2.0471 3.1025 2.1477 1.0549 1.0540 1.9129 1.1184 1.1221 1.7461 1.6419 1.7225 1.9601 1.9509 1.3004 1.3270 1.3471 1.1962 1.1839 1.1700 1.2681 1.3405 1.3157 1.3072 1.3242 1.2927 1.4114 1.3984 1.5357 7.6278 7.6182 1.2720 1.2792 2.1482 2.1483 1.2123 1.2046 1.0917 1.1056 1.0842 1.0842 1.0637 1.0638 1.1022 1.1097 2.1783 2.1653 1.0859 1.0906 6.0418 6.0402 6.1750 6.1758 1.0729 1.0727 1.0804 1.0806 1.0622 1.0668 1.0367 1.0367 1.0609 1.0612 1.0831 1.0818 1.0952 1.1017 1.1018 1.1018 1.0991 1.0991 1.0983 1.0982 1.0867 1.0867 1.0866 1.0866 1.0909 1.0910 1.0959 1.0959 1.1015 1.1015 1.0743 1.0743
irintensity: 0.0040 0.0023 0.0055 0.0139 0.1327 1.7318 0.0679 0.0214 0.0433 0.3634 0.7718 0.0396 0.4548 0.9063 1.5558 0.2876 0.0357 0.2126 1.3170 2.0533 1.0508 10.1002 2.0991 4.0397 1.9172 15.7447 0.1530 0.0053 0.0064 0.1140 9.5682 4.8998 3.1797 11.7144 20.2110 10.5189 100.8609 9.1586 0.2717 87.4915 11.0681 47.1258 48.4831 0.3050 84.0892 13.7813 0.0887 5.7196 0.6494 1.8410 5.0487 0.0996 0.1186 1.1790 1.9289 1.5677 2.6295 1.2156 1.7121 0.8774 0.1677 0.1726 0.0032 0.0515 0.0904 0.1230 7.7402 8.3006 5.9296 0.3637 3.3606 1.2634 4.5288 8.8841 0.3088 10.9365 4.5927 30.5311 0.0735 128.6608 0.3680 0.1257 0.0484 71.1251 0.5794 2.2184 3.1556 28.2972 5.8929 18.4353 5.5629 0.8964 8.5340 4.8078 3.4651 5.7873 0.9625 1.2210 0.0436 2.8655 27.2731 5.0269 75.2644 5.8632 2.3896 1.0360 0.2840 0.3052 42.5035 8.2521 6.6776 5.5025 26.8126 14.8052 1.2376 0.2845 5.4862 5.7051 0.1702 4.8615 8.0221 14.3027 28.0262 14.6184 0.1522 10.6141 1.7640 0.7327 16.0828 6.7717 35.8149 91.6134 104.5794 102.1857 7.9162 44.1597 39.0208 25.6719 24.6542 27.1501 34.9270 35.6783 1.6259 96.5607 17.6597 16.3623 37.0842 48.4337 32.4460 25.6069 16.5067 7.5260 5.3087 5.4046 14.3987 11.8715 35.1398 61.2722 38.0552 13.9708 2.2413 2.2714
temp: 298.150 k
press: 1.00000 atm
elementType: 7 7 6 6 6 6 6 6 6 6 6 6 6 6 6 6 6 6 6 6 6 6 6 6 1 1 1 1 1 1 1 1 1 1 1 1 1 1 1 1 1 1 1 1 1 1 1 1 1 1 1 1 1 1 1 1
symmnumber: 1
zpe: 1284403.3 jmol-1
zpe.correction: 0.489203 hartree
zpe.thermalcorrener: 0.514866 hartree
zpe.thermalcorrenthalpy: 0.515810 hartree
zpe.thermalcorrgfe: 0.427422 hartree
zpe.sumelectzpe: -965.198817 hartree
zpe.sumelectthermal: -965.173155 hartree
zpe.sumelectthermalent: -965.172211 hartree
zpe.sumelectthermalfe: -965.260599 hartree
dipole: -0.0091 0.0000 2.1718
dipole: 2.1718
quadrupole: -145.2209 -140.9582 -149.3677
quadrupole: 0.4151 -0.0114 -0.0479
quadrupole: -0.0386 4.2240 -4.1854 0.4151 -0.0114 -0.0479
hfenergy: -965.6880206 hartree
pointgroup: C01 [X(C22H32N2)]
dipole: 0.0036164 -0.0197839 -0.8542288 debye
polarizability: 353.1138454|14.1654195|236.0730432|-0.200759|-1.3688786|166.2348536 unknown
InChI: InChI=1S/C22H32N2/c1-19(17-21-11-5-3-6-12-21)23-15-9-10-16-24-20(2)18-22-13-7-4-8-14-22/h3-8,11-14,19-20,23-24H,9-10,15-18H2,1-2H3
charge 0 multiplicity 1
56 atoms
N  -2.894638 1.262301 -0.832345
N  2.892167 -1.284098 -0.787609
C  -0.500569 0.580199 -0.780443
C  0.50017 -0.596061 -0.745219
C  -4.342313 0.937146 -0.852767
C  4.340929 -0.964428 -0.820862
C  -1.968701 0.112648 -0.750474
C  1.968931 -0.129687 -0.761183
C  -4.839605 0.629676 0.597632
C  4.837842 -0.602013 0.616811
C  -5.11902 2.114116 -1.472908
C  5.113963 -2.166912 -1.394896
C  -6.249481 0.063004 0.642737
C  6.251672 -0.044145 0.643758
C  -7.350204 0.853972 1.062539
C  7.345641 -0.827882 1.093839
C  -6.501444 -1.274643 0.235406
C  6.514572 1.276064 0.189256
C  -8.663044 0.328557 1.075812
C  8.662372 -0.312259 1.091356
C  -7.810787 -1.80459 0.244428
C  7.827922 1.796134 0.182392
C  -8.898688 -1.003402 0.6644
C  8.908889 1.002376 0.63324
H  -0.326544 1.18191 -1.698608
H  -0.326964 1.256999 0.078574
H  0.317286 -1.258708 -1.618628
H  0.334499 -1.212935 0.159149
H  -4.537118 0.023443 -1.471349
H  4.538632 -0.076385 -1.474642
H  -2.153562 -0.428773 0.197883
H  -2.136018 -0.629208 -1.575102
H  2.126756 0.56295 -1.629258
H  2.167102 0.465117 0.151799
H  -2.642306 1.881356 -1.615627
H  2.638589 -1.939565 -1.540214
H  -4.767639 1.566276 1.180826
H  -4.134702 -0.090343 1.056058
H  4.757453 -1.513712 1.237281
H  4.136757 0.140665 1.043943
H  -4.913403 3.043333 -0.908688
H  -6.205109 1.92363 -1.449981
H  -4.823211 2.275074 -2.527451
H  4.905371 -3.073312 -0.795703
H  6.200668 -1.979376 -1.378932
H  4.817886 -2.367016 -2.442637
H  -7.174004 1.887565 1.385728
H  7.161033 -1.847918 1.453382
H  -5.661598 -1.907168 -0.080054
H  5.680264 1.903312 -0.150531
H  -9.49857 0.95546 1.408253
H  9.492455 -0.933175 1.447784
H  -7.983558 -2.840527 -0.069823
H  8.009154 2.818899 -0.168145
H  -9.914824 -1.413647 0.675484
H  9.928047 1.405208 0.632027
