program: Gaussian 09
title: 000125297
version: EM64L-G09RevD.01
frameworkgroup: C1[X(C8H14O3)]
method: RPBEPBE
basis: SDD
operation: Freq
keyword: #pfreq=noraman
keyword: PBEPBE/SDD
title: #p freq=noraman PBEPBE/SDD
converged: YES YES NO NO
title: Mulliken charges:
elementType: O O O C C C C C C C C H H H H H H H H H H H H H H
charge: -0.452226 -0.404043 -0.266210 -0.078718 -0.430132 -0.455921 -0.515620 -0.172520 0.216437 -0.170691 -0.736393 0.248351 0.227403 0.191970 0.203648 0.230818 0.244749 0.271511 0.220379 0.355808 0.228828 0.219293 0.221217 0.223079 0.378983
chargesum: 0.00000
title: Mulliken charges with hydrogens summed into heavy atoms:
elementType: O O O C C C C C C C C
charge: -0.096418 -0.025060 -0.266210 0.169633 -0.010760 -0.021455 0.000640 0.047859 0.216437 0.058137 -0.072804
polarizability: 1.20454649e+02 7.94053337e+00 8.53975806e+01 1.32743551e+01 -1.22378779e+00 8.36952608e+01
1716.lowfreq: -12.1487 -0.0005 -0.0004 0.0009 5.1514 18.8219 32.3254 40.7394 46.0663
frequency: 32.1731 40.6267 45.8244 85.5873 103.5102 171.8120 190.3780 198.0885 218.9733 283.7313 315.8648 336.8659 428.2999 451.4972 483.4299 504.3514 526.0382 562.2370 659.1568 700.8203 741.0016 788.4333 830.0271 858.2839 877.8175 942.8815 951.1196 980.0135 1004.2366 1025.3802 1044.9021 1062.4235 1088.4912 1089.8222 1116.5468 1179.6570 1189.8528 1228.4859 1233.0021 1282.0098 1286.2628 1298.6525 1312.9878 1334.6301 1357.1887 1365.9010 1393.9547 1397.3864 1424.4153 1454.8028 1459.9849 1461.7697 1473.0371 1638.9784 1688.9335 2963.7725 2966.4703 2977.7794 2999.4328 3025.5987 3037.7190 3044.9504 3050.9239 3064.0063 3069.5680 3074.1624 3093.1427 3462.4242 3500.5423
redmass: 4.7474 5.1066 3.8708 2.4444 2.6256 2.3185 2.4634 2.1545 2.9141 2.2290 2.3953 6.5029 2.2391 2.8807 2.4572 1.9716 3.1685 1.1620 1.3591 3.8350 1.8270 2.2750 2.2785 2.4169 2.1985 1.5494 2.3142 1.0919 2.9043 2.0484 1.5353 1.8770 2.2063 2.7454 1.9224 1.1956 1.3922 1.5230 1.3085 1.3615 1.3113 1.3498 1.3680 1.3898 1.6406 1.4774 1.2405 1.1985 1.1132 1.0943 1.0956 1.0478 1.0579 7.5942 6.1189 1.0365 1.0601 1.0637 1.0635 1.0966 1.0970 1.0936 1.0903 1.0952 1.0953 1.0962 1.0926 1.0653 1.0638
irintensity: 0.9294 0.1989 0.1943 0.4326 1.0142 4.5685 2.6433 2.1622 0.5353 2.2835 1.5767 2.8847 13.8476 2.9742 6.2352 46.4635 19.0678 195.1415 156.7631 2.6627 2.3727 7.6399 2.6332 1.0384 15.8731 22.6109 36.0811 59.6298 5.4357 29.3320 0.1411 258.2656 75.8296 9.2461 17.3043 10.5697 2.6328 10.2078 1.9384 3.0484 12.1198 4.4674 3.1427 6.6327 70.1128 41.6853 10.4105 23.4610 35.4466 8.2961 14.2916 11.7531 16.0076 182.1023 0.9173 44.4634 28.9756 40.0281 9.1917 13.8890 28.6341 4.7689 32.6370 34.3724 5.5356 13.3140 57.2793 54.0019 20.5460
temp: 298.150 k
press: 1.00000 atm
elementType: 8 8 8 6 6 6 6 6 6 6 6 1 1 1 1 1 1 1 1 1 1 1 1 1 1
symmnumber: 1
zpe: 547489.1 jmol-1
zpe.correction: 0.208528 hartree
zpe.thermalcorrener: 0.221444 hartree
zpe.thermalcorrenthalpy: 0.222388 hartree
zpe.thermalcorrgfe: 0.167720 hartree
zpe.sumelectzpe: -538.023611 hartree
zpe.sumelectthermal: -538.010695 hartree
zpe.sumelectthermalent: -538.009750 hartree
zpe.sumelectthermalfe: -538.064419 hartree
dipole: -1.0979 1.4617 -1.9770
dipole: 2.6927
quadrupole: -57.8159 -68.1236 -69.5593
quadrupole: 0.7193 2.5959 2.0663
quadrupole: 7.3504 -2.9573 -4.3931 0.7193 2.5959 2.0663
hfenergy: -538.2321385 hartree
pointgroup: C01 [X(C8H14O3)]
dipole: 0.4274923 -0.5829433 0.7744028 debye
dipolederiv: -0.5447417 -0.19596 -0.0979552 -0.2252994 -0.597411 0.151203 -0.1369575 0.1470365 -0.6084345 -0.9459804 0.2011207 -0.5011793 0.2796458 -0.5081313 0.2114219 -0.4677402 0.1683275 -0.5425033 -0.7213773 0.0793275 0.1212376 0.1299245 -0.3573771 0.0213816 -0.2049406 0.1302395 -0.9764848 0.4379483 0.1204367 0.0278943 0.1908061 0.4416188 -0.094891 0.1136056 -0.1408611 0.4530512 0.0005313 -0.0264132 -0.0431807 -0.0685495 -0.0394668 -0.0119049 -0.0311912 -0.1032787 0.0430708 0.0331708 0.0383379 0.0310354 0.0288237 0.0900064 -0.0144681 0.0218685 0.0750004 0.089611 -0.2901164 0.0892428 -0.0086165 0.0841915 -0.0054624 -0.090508 0.0605747 -0.0371501 -0.1440327 -0.1054203 -0.0816839 -0.135217 -0.046077 -0.0103228 -0.158536 -0.2880132 -0.121173 -0.0294594 1.3388938 -0.3950638 0.1636655 -0.532019 0.3916788 -0.1655777 0.3682769 -0.2187271 1.2806234 0.0138243 -0.1465387 -0.1819706 -0.1222864 0.0156359 -0.1076538 -0.2145003 -0.071843 0.0238082 -0.0587461 0.0657933 0.1155755 0.1202284 0.0420307 -0.0316901 0.0879511 0.0018703 0.0271024 0.0005248 0.057776 0.0845617 0.0759833 0.0014763 -0.0386444 0.056917 -0.0076096 -0.018057 -0.1181072 0.0821051 0.1028868 0.0471909 0.0381391 -0.024978 0.0933913 -0.0633819 0.0038385 0.0727209 -0.0377042 -0.0134093 -0.0121434 -0.0371094 0.104741 -0.0339246 0.1260893 -0.0973349 -0.0231353 -0.0096847 -0.0000521 -0.0385888 -0.1252273 -0.13334 0.0248288 -0.1207848 0.0137453 0.0581669 0.0315378 0.0027025 0.0476103 0.0129676 0.1367331 0.0209172 0.0592448 -0.0301174 0.0592758 0.0148018 0.0041925 0.0044398 0.0479269 0.11935 0.0092044 0.0835634 -0.0196254 0.0210087 -0.045704 -0.0057722 -0.0812962 -0.0226827 -0.0636219 -0.0094144 -0.03443 0.0977609 0.0777204 0.0161229 0.0690122 0.0100732 -0.0127247 0.1249263 0.1153317 0.1251139 -0.0330999 0.3723086 0.052026 0.1297214 0.085662 0.2734746 -0.0776531 0.1046435 -0.0312718 0.3022436 0.0837823 -0.0024273 0.0922426 0.0011733 0.0105538 0.1092389 0.1023467 0.1144295 -0.0293579 0.0818731 0.0258418 0.0039233 -0.0427777 -0.0461616 0.1548386 0.061515 0.0932749 -0.0282856 0.0617839 -0.0293843 -0.0057156 -0.0032164 -0.0956841 -0.123813 0.075825 -0.132062 0.0170847 -0.1706726 0.0590855 -0.0569738 0.0144523 0.1173088 0.0152856 -0.0892876 -0.0077826 0.0207207 0.2647636 0.0370083 0.1013909 0.0520486 0.3749434 -0.0118398 0.158772 -0.0338342 0.184132 unknown
polarizability: 119.7708569|-15.7566462|83.7682435|-4.0073575|-0.3168638|86.0083899 unknown
InChI: InChI=1S/C8H14O3/c1-2-3-4-5-7(9)6-8(10)11/h2-3,7,9-10H,4-6H2,1H3
charge 0 multiplicity 1
25 atoms
O  0.441949 1.357435 -0.970539
O  3.857863 -0.485362 1.0699
O  3.005365 0.078895 -1.006148
C  0.335137 0.442258 0.177247
C  -0.075923 -0.980906 -0.265924
C  -1.47161 -0.995531 -0.949659
C  1.637102 0.467308 1.021509
C  -2.609275 -0.743975 0.020797
C  2.854075 0.016224 0.240843
C  -3.425965 0.342729 0.000676
C  -4.565079 0.599417 0.962417
H  -0.4770 0.873781 0.788428
H  0.683397 -1.380766 -0.967154
H  -0.088912 -1.649813 0.619668
H  -1.61257 -1.98168 -1.437227
H  -1.477012 -0.22886 -1.746298
H  1.543199 -0.146261 1.934171
H  1.825699 1.509599 1.347154
H  -2.764342 -1.511609 0.797832
H  1.233005 1.06464 -1.502047
H  -3.258223 1.107072 -0.774309
H  -4.658622 -0.211875 1.706291
H  -4.421878 1.552893 1.507976
H  -5.530063 0.684013 0.425078
H  4.650583 -0.734726 0.519421
