program: Gaussian 09
title: 000125290
version: EM64L-G09RevD.01
frameworkgroup: C1[X(C22H26IN3O5S)]
method: RPBEPBE
basis: SDD
operation: Freq
keyword: #p
keyword: freq=noraman
keyword: PBEPBE/SDD
title: #p freq=noraman PBEPBE/SDD
converged: YES YES NO NO
title: Mulliken charges:
elementType: I S O O O O O N N N C C C C C C C C C C C C C C C C C C C C C C H H H H H H H H H H H H H H H H H H H H H H H H H H
charge: 0.097911 1.005392 -0.303653 -0.548720 -0.485753 -0.371002 -0.410959 -0.409413 -0.693173 -0.390031 -0.046447 -0.445687 -0.396612 -0.410633 -0.413562 -0.376500 0.400783 -0.062007 0.540847 -0.575045 -0.260612 -0.187369 -0.363485 -0.415869 -0.374794 0.285202 0.164332 0.152315 -0.198098 -0.322326 -0.413521 -0.151114 0.255906 0.202617 0.219238 0.247206 0.184213 0.211048 0.175777 0.193807 0.228453 0.203292 0.191549 0.291570 0.337819 0.225851 0.216889 0.289598 0.305122 0.240753 0.240417 0.231751 0.271763 0.308164 0.208439 0.256972 0.253526 0.387860
chargesum: 0.00000
title: Mulliken charges with hydrogens summed into heavy atoms:
elementType: I S O O O O O N N N C C C C C C C C C C C C C C C C C C C C C C
charge: 0.097911 1.005392 -0.303653 -0.548720 -0.485753 -0.371002 -0.023098 -0.117844 -0.355354 -0.081867 0.209459 -0.023832 0.034806 -0.023808 0.008698 0.018341 0.400783 -0.062007 0.540847 -0.132305 0.028986 0.117753 -0.122732 -0.175452 0.128720 0.285202 0.164332 0.152315 0.010341 -0.065354 -0.413521 0.102413
polarizability: 3.48608202e+02 -2.90319856e+00 3.56780409e+02 -5.17428830e+01 -7.34561228e+00 2.60891287e+02
1716.lowfreq: -11.2887 -7.3785 -0.0016 -0.0013 -0.0007 1.4307 2.4570 8.3534 11.3667
frequency: -10.7902 7.7500 11.2456 27.7359 30.5375 34.9850 45.2577 48.4969 53.3964 59.7624 66.8571 90.3913 102.1387 110.2095 119.9983 134.5857 143.5706 158.4426 177.0436 192.9310 204.1079 220.6988 227.6527 228.4299 246.5829 258.0575 272.7656 292.2097 307.7747 311.2732 320.5209 338.6174 365.4913 374.1820 384.7094 393.0889 406.5471 407.6809 412.5587 430.8506 443.2171 457.9163 468.8155 481.2239 508.9056 510.4846 511.9118 533.7775 562.4802 590.9290 600.4469 620.0956 622.4499 655.5192 670.2211 676.7808 706.2946 722.9113 732.8921 748.0316 757.5115 771.7575 789.1759 801.2758 812.5739 823.5028 827.7893 831.5693 839.5321 847.5992 851.9388 862.0332 868.3016 879.6367 919.3184 944.1979 948.9780 951.6876 960.1436 961.6038 963.8182 979.6118 993.3007 1004.8990 1025.1056 1028.1078 1037.9402 1044.6171 1052.1569 1056.7105 1068.8982 1087.3338 1107.2442 1114.8262 1122.7387 1143.0950 1149.6814 1152.3462 1175.3091 1188.4280 1193.6643 1208.6239 1232.7654 1239.6916 1240.1981 1256.4454 1262.9757 1270.9432 1291.9848 1294.8759 1303.1944 1312.8273 1328.9274 1329.1571 1333.0463 1338.6517 1347.2793 1351.0451 1354.8749 1357.9145 1368.3418 1387.9709 1390.8985 1398.5018 1402.5032 1453.5805 1455.6271 1459.0218 1462.7888 1463.3933 1467.6311 1468.3238 1470.8451 1474.8554 1486.7868 1520.5867 1557.4299 1576.0333 1594.1677 1597.7097 1613.5738 1636.6902 2731.3984 2946.3527 2964.9784 2970.7885 2976.4829 2983.2423 2985.7261 2999.0040 3025.9984 3031.7369 3035.8364 3044.5004 3044.5558 3047.9665 3059.4813 3090.5503 3134.3258 3137.7171 3138.2306 3159.6198 3164.6893 3180.3540 3188.0419 3496.4988 3551.8721 3568.8878
redmass: 6.2784 7.4675 9.0155 3.8497 5.5790 5.1215 4.0261 5.4092 7.3243 6.0129 5.6329 5.7969 5.3821 7.0319 6.9266 6.3220 5.3494 5.7109 4.5057 3.0837 5.9892 6.4266 5.8711 3.8993 6.0264 4.8764 3.8386 2.6100 6.1100 1.4543 3.6915 3.6421 2.5518 3.3174 2.9832 3.0606 2.9658 3.1690 5.8298 7.9932 5.0524 2.5040 2.2047 2.8925 2.7250 1.7958 2.8224 2.9756 1.6273 3.2198 6.8614 5.3470 2.8904 6.1430 5.6374 7.0790 8.1959 3.5954 4.7451 3.9930 4.0432 1.5270 4.9107 3.3468 9.5626 1.5206 1.7425 1.7337 2.0871 1.6633 1.5978 2.3783 2.2257 2.4286 1.4102 1.9829 1.0848 4.0808 1.5248 2.0691 2.1717 1.3788 5.6896 2.9400 4.3667 2.6649 2.0646 1.4688 2.4373 1.8242 2.1663 1.7069 2.3153 1.0517 1.4005 2.0821 1.5658 1.7353 1.7494 1.1619 1.4565 2.4447 1.4870 1.2936 1.2346 1.3543 2.6456 1.3359 1.4704 1.6592 1.3216 1.5327 1.3825 1.3690 1.4330 1.7310 1.9515 1.4702 1.5109 1.5172 1.4286 6.0750 3.8753 3.3754 2.8062 1.1741 2.1064 1.1089 1.3655 1.1986 1.1867 1.1145 1.0944 1.9752 1.1969 1.9726 8.0307 3.3922 6.1006 7.3584 7.3213 3.8792 1.0704 1.0680 1.0639 1.0665 1.0628 1.0619 1.0609 1.0655 1.0913 1.0989 1.0867 1.1017 1.1019 1.0970 1.0978 1.0976 1.0895 1.0909 1.0907 1.0884 1.0957 1.0977 1.0951 1.0788 1.0774 1.0767
irintensity: 0.0440 1.2751 0.0518 0.0557 0.2582 1.8045 0.6779 1.7616 1.7740 4.7660 4.0268 0.2226 6.1472 4.2409 0.6427 4.0753 0.8256 0.8409 0.8224 0.9462 3.1146 1.8131 2.6198 4.3082 2.1947 8.9571 10.0950 4.8808 5.4262 4.5965 4.7403 17.3083 2.5798 5.2312 15.6186 8.4281 4.4052 1.8596 34.6618 21.0487 25.3022 20.8365 16.7052 42.4299 45.6256 134.6515 0.8725 23.2699 152.9539 15.8743 28.5949 1.7440 7.6008 103.4553 2.2914 12.2018 20.0371 1.6572 63.5237 4.3840 17.0069 1.1332 1.0126 7.7724 152.2238 66.0423 8.9517 8.7898 13.9220 10.2884 11.4393 10.8030 6.1213 23.4902 13.7546 2.0045 152.4064 34.3469 14.7244 15.4807 26.0408 0.1946 2.7167 20.2871 10.0757 28.7696 18.1924 2.1962 21.6395 3.2104 9.4505 0.4740 5.7138 4.8171 5.2549 2.5127 4.9877 12.1456 59.0296 15.4940 5.1481 20.7586 52.2906 2.2506 69.9674 16.8673 74.4355 25.0454 20.0076 161.6061 21.6445 36.9059 2.0135 14.1719 1.7040 102.9104 89.0487 29.2936 23.0289 11.7820 35.2100 7.0244 33.0566 40.6194 15.3507 94.3065 154.2072 10.0493 209.7030 104.8850 51.6303 32.9627 27.3515 23.3093 97.8441 273.5415 154.3091 8.5629 13.1154 1.6933 154.4729 44.3537 484.0800 36.0608 34.1389 17.8858 33.0706 28.9067 12.5439 88.8734 84.0556 57.6787 20.8373 16.6021 23.2003 69.1100 41.9356 7.8850 11.0434 8.3829 11.6178 1.2266 5.6588 5.7444 6.1672 28.0457 33.6878 16.6590
temp: 298.150 k
press: 1.00000 atm
elementType: 53 16 8 8 8 8 8 7 7 7 6 6 6 6 6 6 6 6 6 6 6 6 6 6 6 6 6 6 6 6 6 6 1 1 1 1 1 1 1 1 1 1 1 1 1 1 1 1 1 1 1 1 1 1 1 1 1 1
symmnumber: 1
zpe: 1183142.1 jmol-1
zpe.correction: 0.450635 hartree
zpe.thermalcorrener: 0.481798 hartree
zpe.thermalcorrenthalpy: 0.482742 hartree
zpe.thermalcorrgfe: 0.383329 hartree
zpe.sumelectzpe: -1801.391883 hartree
zpe.sumelectthermal: -1801.360720 hartree
zpe.sumelectthermalent: -1801.359776 hartree
zpe.sumelectthermalfe: -1801.459189 hartree
dipole: 4.4754 -0.4483 3.2714
dipole: 5.5617
quadrupole: -236.2631 -168.4570 -229.4377
quadrupole: -28.3181 -21.0817 -8.4224
quadrupole: -24.8772 42.9289 -18.0518 -28.3181 -21.0817 -8.4224
hfenergy: -1801.842518 hartree
pointgroup: C01 [X(C22H26I1N3O5S1)]
dipole: 1.9629127 -0.8859841 -0.3872403 debye
polarizability: 310.8734987|30.3823068|337.3938721|55.856398|-36.5284774|318.0125282 unknown
InChI: InChI=1S/C22H26IN3O5S/c23-16-8-11-20(27)19(14-16)21(28)24-13-12-15-6-9-18(10-7-15)32(30,31)26-22(29)25-17-4-2-1-3-5-17/h6-11,14,17,24-27H,1-5,12-13H2
charge 0 multiplicity 1
58 atoms
I  4.238205 -2.799878 4.19736
S  -2.928624 3.078744 -0.422523
O  -2.206632 0.409657 0.957862
O  -3.4088 3.859252 -1.768906
O  -3.609292 3.400916 1.007118
O  2.700494 0.205731 -1.729858
O  1.779984 -2.129135 -1.625522
N  -3.425787 -0.963996 -0.496097
N  -3.227901 1.337005 -0.932813
N  3.804655 1.207441 0.042595
C  -3.068707 -2.22462 0.204092
C  -4.185473 -3.274289 -0.016937
C  -1.693072 -2.768909 -0.268657
C  -4.225984 -3.810327 -1.471106
C  -1.737205 -3.280694 -1.726728
C  -2.842409 -4.347795 -1.913729
C  -2.91848 0.252591 -0.079935
C  -1.053982 3.20593 -0.281602
C  1.708923 3.519214 -0.09073
C  3.21994 3.665879 -0.004637
C  -0.362583 3.656619 -1.417079
C  -0.44578 2.910129 0.945839
C  1.035507 3.806504 -1.307254
C  0.9546 3.078187 1.026769
C  3.992099 2.485035 -0.662814
C  3.168709 0.128478 -0.522495
C  3.027933 -1.135819 0.25266
C  2.316181 -2.224073 -0.36392
C  3.565377 -1.322094 1.557646
C  2.152936 -3.446702 0.339113
C  3.39847 -2.54134 2.230694
C  2.688242 -3.610875 1.6258
H  -3.000626 -1.966583 1.276454
H  -3.985041 -4.123045 0.66623
H  -5.164657 -2.848678 0.275352
H  -0.92866 -1.980059 -0.152155
H  -1.405001 -3.600563 0.407464
H  -4.992795 -4.604651 -1.550041
H  -4.547786 -3.010119 -2.173122
H  -1.92703 -2.42717 -2.409997
H  -0.747245 -3.683084 -2.009955
H  -2.88286 -4.681753 -2.968548
H  -2.592109 -5.241241 -1.304197
H  -3.973037 -1.029391 -1.35514
H  -3.878695 1.294137 -1.725962
H  3.544182 4.589444 -0.522255
H  3.537697 3.765363 1.051314
H  -0.90356 3.89746 -2.337597
H  -1.039888 2.552887 1.790311
H  1.604747 4.155843 -2.176576
H  1.460886 2.86242 1.974421
H  5.071903 2.729031 -0.690088
H  3.648256 2.326373 -1.69798
H  4.148879 1.13693 1.000119
H  4.124786 -0.522711 2.054997
H  1.605358 -4.256067 -0.151783
H  2.55857 -4.559737 2.153761
H  2.015683 -1.178904 -1.976731
