program: Gaussian 09
title: 000125273
version: EM64L-G09RevD.01
frameworkgroup: C1[X(C18H17NO8)]
method: RPBEPBE
basis: SDD
operation: Freq
keyword: #p
keyword: freq=noraman
keyword: PBEPBE/SDD
title: #p freq=noraman PBEPBE/SDD
converged: YES YES NO NO
title: Mulliken charges:
elementType: O O O O O O O O N C C C C C C C C C C C C C C C C C C H H H H H H H H H H H H H H H H H
charge: -0.282990 -0.263559 -0.418427 -0.413614 -0.448839 -0.431544 -0.257439 -0.234109 0.013188 -0.078511 -0.137546 -0.210428 -0.086230 -0.053154 -0.363694 0.394021 -0.481423 -0.396382 0.298457 0.016473 -0.308584 0.339884 0.004236 -0.502113 -0.274687 0.171795 -0.308173 0.201141 0.261623 0.255206 0.230789 0.230635 0.221425 0.224248 0.359534 0.341003 0.365780 0.356476 0.307685 0.265210 0.273325 0.287079 0.268194 0.264040
chargesum: 0.00000
title: Mulliken charges with hydrogens summed into heavy atoms:
elementType: O O O O O O O O N C C C C C C C C C C C C C C C C C C
charge: -0.282990 -0.263559 -0.058894 -0.072611 -0.083059 -0.075068 -0.257439 -0.234109 0.013188 0.122630 0.124078 0.044778 0.144559 0.177481 0.081979 0.394021 -0.173738 -0.131172 0.298457 0.016473 -0.035259 0.339884 0.004236 -0.215034 -0.006493 0.171795 -0.044133
polarizability: 4.43170986e+02 -7.21769407e+01 2.53267239e+02 -1.57826298e+01 3.36277402e+01 1.35144241e+02
1716.lowfreq: -5.5205 -2.9695 -2.0083 -0.0006 -0.0005 0.0003 18.4811 26.0698 32.3138
frequency: 18.2884 26.0610 32.3071 56.9208 67.8801 76.8766 96.5924 98.8749 117.6392 161.5389 167.4717 169.8654 170.4976 215.7086 223.3268 250.6946 257.6999 262.1206 286.4303 310.4126 321.2530 345.5812 363.3239 369.5907 373.0584 385.4865 404.1242 411.0772 426.4004 431.5846 441.0155 447.0612 462.4052 467.3959 487.2260 512.1958 552.0661 562.8872 577.9733 601.5539 604.9729 622.0709 636.9277 667.1825 694.4441 720.6910 723.8353 745.2114 756.8016 807.6777 815.2181 823.6631 830.4790 841.6365 848.6911 859.7174 876.8308 884.7768 927.9336 945.5202 953.4173 964.7980 970.0233 986.3434 993.5231 1010.9865 1015.2975 1037.0596 1048.0730 1065.8737 1074.5663 1091.0356 1108.0574 1114.3704 1128.7819 1145.4736 1170.6625 1190.8951 1203.3399 1205.0056 1219.1827 1225.5538 1245.3570 1246.8832 1260.4851 1264.4037 1287.0858 1297.1358 1308.4237 1321.4294 1330.6819 1338.3643 1344.0919 1364.9438 1369.9734 1370.7651 1378.8352 1384.1614 1394.6092 1409.7882 1438.8367 1461.2812 1462.2475 1471.3872 1535.4726 1561.8339 1571.1280 1602.5913 1650.0603 2921.5527 2947.5873 2975.8716 3002.5860 3005.3503 3070.0149 3090.5675 3151.2462 3165.7117 3174.1489 3178.0298 3179.6266 3185.6186 3509.7849 3540.1729 3554.8452 3579.7286
redmass: 7.5422 5.9000 6.9877 7.2662 7.3158 5.4093 4.6622 5.1152 7.8537 6.5508 5.2693 4.4799 5.3905 5.8597 4.7273 5.1475 5.0221 5.0791 4.0887 5.4716 5.5255 4.6160 2.4395 3.5604 1.5227 3.4909 1.2413 1.8132 3.8579 2.3518 1.6977 5.0965 5.3339 3.1438 7.0389 4.3066 10.3408 7.0652 4.1235 5.0636 4.5627 5.9707 3.3609 4.2856 8.0797 3.7574 5.3724 5.3282 3.9464 5.2814 4.0561 1.4592 1.5249 4.6434 3.1055 1.7088 1.6959 3.7200 2.3396 4.2564 4.2532 1.3339 4.0581 1.2926 4.3116 4.9534 4.6020 2.6644 2.4988 2.6611 2.9232 2.0249 2.9958 2.1970 1.4691 2.1342 1.1428 1.3554 2.0453 1.3332 2.1724 1.3310 1.7020 2.1835 1.2884 1.4045 1.2797 3.6693 1.4411 1.2887 1.2945 2.1396 1.2789 1.9932 1.9938 1.2629 1.3577 1.4825 1.3763 5.8774 5.1401 5.6503 1.0876 4.1293 7.5757 8.3647 8.4784 6.8309 8.0833 1.0817 1.0834 1.0836 1.0650 1.0838 1.0871 1.1003 1.0873 1.0886 1.0983 1.0944 1.0927 1.0978 1.0653 1.0654 1.0658 1.0663
irintensity: 0.2773 0.2751 0.5710 0.3713 0.9189 6.4566 2.7468 1.7659 3.5750 0.9984 3.8005 3.0163 1.0054 15.4153 5.7944 4.7621 3.7982 6.3927 13.2219 2.1657 13.2994 8.3250 54.5898 27.0646 56.5943 58.0386 222.2580 60.2298 2.2248 57.6821 147.4774 26.5296 31.9946 6.8700 15.0079 18.7795 1.5156 1.1890 2.8951 7.7829 6.5940 2.6443 10.7716 108.0639 4.1527 3.1694 10.7743 4.5829 0.0549 6.7637 44.2166 4.0078 34.2458 16.2291 69.7361 13.6944 78.3192 17.4803 49.6319 108.2831 45.7766 0.3750 226.7415 0.0014 97.7507 135.8168 223.4353 52.2485 36.9189 43.7821 34.1511 103.7366 57.5605 24.3284 22.1758 106.1904 53.8998 4.6011 228.2250 32.8905 10.3970 48.3415 154.9822 53.7162 20.0272 26.6805 4.1974 59.1276 28.7147 3.4086 32.6817 30.8013 0.8563 18.0851 27.8366 28.3761 10.6595 7.5665 14.6633 4.3588 12.7941 81.7110 6.6387 191.6684 104.5691 38.1484 62.2169 515.4318 20.1600 31.3041 23.4378 21.4965 29.3532 42.8059 11.4962 22.5134 0.0960 0.8501 10.5487 1.4288 0.5083 4.8044 5.2967 21.8885 11.0252 17.0484
temp: 298.150 k
press: 1.00000 atm
elementType: 8 8 8 8 8 8 8 8 7 6 6 6 6 6 6 6 6 6 6 6 6 6 6 6 6 6 6 1 1 1 1 1 1 1 1 1 1 1 1 1 1 1 1 1
symmnumber: 1
zpe: 858151.7 jmol-1
zpe.correction: 0.326853 hartree
zpe.thermalcorrener: 0.350799 hartree
zpe.thermalcorrenthalpy: 0.351743 hartree
zpe.thermalcorrgfe: 0.272515 hartree
zpe.sumelectzpe: -1350.613575 hartree
zpe.sumelectthermal: -1350.589630 hartree
zpe.sumelectthermalent: -1350.588685 hartree
zpe.sumelectthermalfe: -1350.667913 hartree
dipole: 3.0179 -5.8761 0.1427
dipole: 6.6073
quadrupole: -204.9327 -159.6287 -157.5867
quadrupole: 16.0240 15.3253 1.6727
quadrupole: -30.8833 14.4207 16.4626 16.0240 15.3253 1.6727
hfenergy: -1350.9404281 hartree
pointgroup: C01[X(C18H17N1O8)]
dipole: -1.1535251 2.1061432 -0.9955256 debye
polarizability: 441.8785269|-64.8567904|203.5265507|39.5618216|-67.4642352|186.1773883 unknown
InChI: InChI=1S/C18H17NO8/c20-7-14-15(22)16(23)17(24)18(27-14)25-9-2-4-11-13(6-9)26-12-5-8(21)1-3-10(12)19-11/h1-6,14-18,20,22-24H,7H2
charge 0 multiplicity 1
44 atoms
O  -2.792882 -0.807112 -0.216362
O  -2.08274 1.299775 -1.002932
O  -6.499708 0.80653 0.958661
O  -5.554247 -1.518064 -0.584494
O  -4.286223 2.56632 0.525359
O  -1.815293 -3.31056 0.660305
O  2.21473 -0.455158 0.501867
O  6.548081 -2.050349 1.853149
N  3.528593 1.159203 -1.498357
C  -5.11559 0.374432 1.025956
C  -5.028919 -1.142814 0.728902
C  -4.233995 1.181222 0.049401
C  -3.542481 -1.558563 0.849215
C  -2.796607 0.635166 0.065448
C  -3.251432 -3.038032 0.582152
C  -0.680197 1.193509 -1.05701
C  0.07784 0.363305 -0.201345
C  -0.061172 1.994843 -2.055957
C  1.472975 0.369783 -0.354964
C  2.136279 1.164104 -1.343696
C  1.331325 1.974747 -2.1929
C  3.62631 -0.476427 0.366948
C  4.237032 0.370441 -0.674249
C  4.359355 -1.277608 1.204658
C  5.685921 0.328377 -0.790835
C  5.825462 -1.31871 1.088919
C  6.441135 -0.466121 0.037466
H  -4.706983 0.542669 2.050875
H  -5.660354 -1.687394 1.451256
H  -4.635007 1.10117 -0.981808
H  -3.12488 -1.274442 1.838744
H  -2.305596 0.831809 1.045628
H  -3.679272 -3.336333 -0.394938
H  -3.712411 -3.653477 1.372333
H  -6.506547 1.793644 1.065973
H  -4.89278 -1.232316 -1.269533
H  -3.877047 3.160599 -0.152566
H  -1.369022 -2.79429 -0.059225
H  -0.376407 -0.293335 0.543743
H  -0.69128 2.613693 -2.699815
H  1.839993 2.578517 -2.949611
H  3.880864 -1.897267 1.967961
H  6.129752 0.959598 -1.566946
H  7.532927 -0.507485 -0.038478
