program: Gaussian 09
title: 000125252
version: EM64L-G09RevD.01
frameworkgroup: C1[X(C18H23BrN4O3)]
method: RPBEPBE
basis: SDD
operation: Freq
keyword: #p
keyword: freq=noraman
keyword: PBEPBE/SDD
title: #p freq=noraman PBEPBE/SDD
converged: YES YES NO NO
title: Mulliken charges:
elementType: Br O O O N N N N C C C C C C C C C C C C C C C C C C H H H H H H H H H H H H H H H H H H H H H H H
charge: -0.043122 -0.443494 -0.319396 -0.261615 -0.349062 -0.349080 -0.470919 -0.024349 0.293200 -0.409037 -0.429655 -0.747263 -0.694401 -0.142572 -0.306242 0.295179 0.388354 0.316032 0.208781 -0.540549 -0.372039 -0.324388 -0.747683 -0.487432 0.351734 -0.246354 0.212518 0.271008 0.246278 0.232483 0.236733 0.242339 0.217865 0.202364 0.216261 0.223794 0.227553 0.214159 0.232315 0.232119 0.313098 0.352608 0.267529 0.253624 0.241305 0.310259 0.308466 0.275844 0.324849
chargesum: 0.00000
title: Mulliken charges with hydrogens summed into heavy atoms:
elementType: Br O O O N N N N C C C C C C C C C C C C C C C C C C
charge: -0.043122 -0.090885 -0.319396 -0.261615 -0.102784 -0.035981 -0.146070 -0.024349 0.293200 0.074490 0.039561 -0.084695 -0.026793 0.071587 0.158192 0.295179 0.388354 0.316032 0.208781 -0.273021 -0.118416 -0.083083 -0.128958 -0.211589 0.351734 -0.246354
polarizability: 3.04933782e+02 -5.77347313e+01 2.52906589e+02 -1.60080364e+01 7.82690830e+00 2.31318275e+02
1716.lowfreq: -7.9540 -4.3459 -1.5139 -0.0009 -0.0008 -0.0006 4.4980 8.8482 16.9724
frequency: -2.6827 7.4304 16.9522 20.5126 29.7001 45.4111 55.3311 59.4883 77.9562 80.0603 86.7731 127.4920 132.0251 136.2446 157.0386 181.1371 191.6439 212.9208 223.1188 245.3960 248.3563 254.2193 276.8997 300.3202 325.1920 332.3858 346.9984 359.9932 388.4607 400.4560 405.6447 422.1954 427.0826 431.9487 468.5347 486.4107 487.1261 513.8933 528.0604 531.1562 559.4485 575.4932 610.8226 611.7247 620.4298 629.9713 631.5859 647.1484 648.8107 660.5836 743.6385 744.8956 773.0356 807.2939 815.0665 829.7827 837.6147 843.4476 861.9525 869.2139 872.0700 912.9884 930.2408 934.2549 942.6345 949.7394 960.7777 973.2194 975.6830 995.9252 1026.3452 1073.8741 1080.4723 1099.7293 1111.7499 1124.1861 1138.0254 1138.9777 1167.6793 1178.1543 1186.4863 1214.9210 1223.0829 1225.1607 1231.8113 1234.9989 1237.2462 1245.4947 1250.8806 1303.4937 1304.9305 1310.6477 1330.2076 1349.3721 1352.9630 1361.9126 1374.6937 1376.1841 1377.9542 1393.4597 1411.6588 1421.8566 1445.7719 1453.5894 1454.1495 1458.2597 1464.9207 1466.0932 1479.3567 1482.4039 1483.0174 1490.0336 1508.9077 1526.9097 1589.5631 1604.8444 1635.9711 2175.7553 2943.3970 2968.9513 2978.6685 2983.4878 2995.0271 3032.2854 3051.7415 3062.3805 3067.9018 3069.4281 3071.2393 3088.1372 3092.4588 3097.2017 3145.4512 3150.7077 3169.0206 3172.1567 3230.4213 3437.5281 3508.6748 3533.0922 3608.8267
redmass: 6.6299 10.0854 7.1054 4.7780 5.2849 3.8183 4.3647 5.9947 4.0397 4.9891 7.2860 2.9862 4.5183 6.7603 4.3548 1.8776 5.4262 2.2116 1.9616 3.5898 1.4526 3.1332 3.3000 3.7624 6.0764 4.5260 2.3244 6.3236 2.9588 2.8752 3.1428 3.0688 1.5260 1.8606 4.3598 3.8132 5.1972 2.8682 4.3414 1.1662 3.2489 5.8294 1.6066 3.2492 4.6322 5.5877 3.0038 3.9029 3.7898 1.2788 3.5728 3.4775 4.7620 1.5569 1.3730 4.2237 2.6653 3.1024 1.7329 1.7413 2.2879 2.8470 1.6394 2.7815 1.3318 1.6355 3.3073 2.4348 3.1246 1.8716 1.6483 2.0700 5.3187 3.4178 1.9244 1.4468 1.3166 1.1398 1.4295 2.7850 2.4466 1.6264 1.7013 1.3259 1.9695 1.5164 1.8407 1.5638 1.5257 1.6848 1.6062 4.9658 1.3182 1.3455 1.3085 1.3414 1.4856 3.3968 1.3559 1.2115 1.0967 3.0280 1.1302 1.3818 1.1713 1.0814 2.1980 1.0900 1.1254 2.4042 1.3675 1.0795 1.8864 4.9131 6.0478 8.0496 7.4456 12.5940 1.0693 1.0386 1.0553 1.0627 1.0361 1.0853 1.1081 1.0966 1.0567 1.0927 1.0983 1.0994 1.0985 1.0996 1.0889 1.1089 1.0924 1.0960 1.0986 1.0742 1.0774 1.0653 1.0813
irintensity: 0.2217 0.1433 0.8422 0.8971 0.2410 0.0749 1.2344 6.1733 7.2829 4.1571 2.1097 3.6047 6.9694 1.3373 5.7062 4.7292 1.1868 2.5005 0.7869 3.1501 1.9160 7.9258 0.8384 1.3905 1.6958 6.2899 2.4306 4.3803 6.8305 4.3358 38.9709 3.7643 89.2302 81.8300 0.2197 21.6001 7.1180 20.4005 21.1484 93.8926 5.3339 2.1643 66.2365 7.5132 84.6767 18.0952 33.9934 2.8128 9.9608 101.1842 4.4249 3.4945 9.5474 50.3325 12.9961 5.8428 11.0318 7.1982 78.0228 18.1635 4.2013 23.5959 1.5235 12.3023 0.4859 0.8100 48.6591 1.5555 16.6268 31.0283 33.8735 33.1363 1.9242 39.5139 22.1118 7.1180 16.5704 0.5050 57.5430 339.0115 89.2517 17.0454 5.7459 53.7889 42.0620 6.3477 5.8240 2.8024 36.4442 36.0779 24.1693 10.3057 7.4998 16.0686 9.2469 0.8240 25.9028 60.5953 34.5055 29.2981 31.6568 51.7317 24.0096 66.4870 22.2354 3.7792 10.3829 3.9850 7.1379 18.3341 22.8573 39.1673 208.6728 64.8901 19.4365 180.6073 49.3540 160.6024 59.2526 26.9200 20.7002 49.6234 8.8886 27.5151 26.2531 25.7138 2.2055 21.6529 13.7799 3.2064 56.0400 37.0626 5.6829 0.0524 8.7633 6.4415 0.3969 0.7985 47.1050 14.7774 85.5064
temp: 298.150 k
press: 1.00000 atm
elementType: 35 8 8 8 7 7 7 7 6 6 6 6 6 6 6 6 6 6 6 6 6 6 6 6 6 6 1 1 1 1 1 1 1 1 1 1 1 1 1 1 1 1 1 1 1 1 1 1 1
symmnumber: 1
zpe: 1021777.2 jmol-1
zpe.correction: 0.389174 hartree
zpe.thermalcorrener: 0.415524 hartree
zpe.thermalcorrenthalpy: 0.416468 hartree
zpe.thermalcorrgfe: 0.327931 hartree
zpe.sumelectzpe: -1155.895640 hartree
zpe.sumelectthermal: -1155.869290 hartree
zpe.sumelectthermalent: -1155.868346 hartree
zpe.sumelectthermalfe: -1155.956883 hartree
dipole: -3.1839 0.9552 -0.7239
dipole: 3.4020
quadrupole: -200.9365 -184.4381 -155.6272
quadrupole: 9.7390 23.3008 -20.8251
quadrupole: -20.6026 -4.1042 24.7068 9.7390 23.3008 -20.8251
hfenergy: -1156.2848139 hartree
pointgroup: C01 [X(C18H23Br1N4O3)]
dipole: -1.2512944 -0.1762633 0.4412266 debye
polarizability: 322.5707856|48.8708218|237.9439825|3.9713477|-0.548295|228.6438782 unknown
InChI: InChI=1S/C18H23BrN4O3/c1-18(2,11-21-17(25)7-19)22-9-14(24)10-26-15-3-4-16-12(6-15)5-13(8-20)23-16/h3-6,14,21-24H,7,9-11H2,1-2H3
charge 0 multiplicity 1
49 atoms
Br -6.911731 3.462404 0.922874
O  -0.735997 -4.307564 -0.450215
O  0.615937 -1.873573 -0.621833
O  -4.931558 0.867624 -1.765629
N  -2.37283 -1.581171 1.586104
N  -5.215703 0.791124 0.55634
N  4.969238 1.483676 -1.569575
N  7.78855 2.848507 0.144333
C  -3.041704 -0.255619 1.431632
C  -4.452741 -0.449274 0.762948
C  -2.120354 -2.426296 0.398152
C  -3.204188 0.326119 2.856678
C  -2.166622 0.693394 0.579718
C  -0.858484 -3.301717 0.613768
C  0.419617 -2.462593 0.719334
C  -5.392687 1.348882 -0.681507
C  1.727243 -1.034546 -0.819313
C  3.746548 0.142971 -0.172622
C  3.835133 0.672949 -1.509352
C  2.672285 -0.725542 0.17514
C  1.827562 -0.499188 -2.144172
C  2.878333 0.356278 -2.502647
C  -6.207654 2.638414 -0.809569
C  4.866208 0.663362 0.566714
C  5.600487 1.481546 -0.309325
C  6.787725 2.22418 -0.066735
H  -5.050577 -1.134916 1.396662
H  -4.327108 -0.913416 -0.230952
H  -2.784591 -2.118052 2.361367
H  -1.947206 -1.778004 -0.477871
H  -2.955908 -3.113326 0.142032
H  -2.214727 0.422426 3.336247
H  -3.66956 1.327845 2.831372
H  -3.831992 -0.33053 3.491706
H  -2.622804 1.69778 0.53408
H  -1.163265 0.782437 1.031488
H  -2.052672 0.336841 -0.458421
H  -0.97098 -3.887693 1.544795
H  0.283907 -1.663946 1.473576
H  1.288995 -3.101236 0.970191
H  -5.637386 1.262342 1.361519
H  -0.3851 -3.840098 -1.253166
H  2.598119 -1.130448 1.18753
H  1.056767 -0.776358 -2.86956
H  2.943957 0.759579 -3.518228
H  -7.100581 2.451166 -1.424638
H  -5.589347 3.421344 -1.272814
H  5.121263 0.475471 1.607566
H  5.299183 1.998544 -2.383519
