program: Gaussian 09
title: 000125205
version: EM64L-G09RevD.01
frameworkgroup: C1[X(C13H6I2N2)]
method: RPBEPBE
basis: SDD
operation: Freq
keyword: #p
keyword: freq=noraman
keyword: PBEPBE/SDD
title: #p freq=noraman PBEPBE/SDD
converged: NO NO NO NO
title: Mulliken charges:
elementType: I I N N C C C C C C C C C C C C C H H H H H H
charge: 0.112239 0.112237 -0.038288 -0.015857 0.276608 0.276596 0.146110 0.146104 -0.060157 -0.389490 -0.389484 -0.338899 -0.338901 -0.167241 -0.167250 -0.359921 -0.359918 0.254906 0.254906 0.272500 0.272505 0.250348 0.250346
chargesum: 0.00000
title: Mulliken charges with hydrogens summed into heavy atoms:
elementType: I I N N C C C C C C C C C C C C C
charge: 0.112239 0.112237 -0.038288 -0.015857 0.276608 0.276596 0.146110 0.146104 -0.060157 -0.134584 -0.134578 -0.066399 -0.066395 0.083107 0.083097 -0.359921 -0.359918
polarizability: 4.11704566e+02 2.00908886e-02 2.23401179e+02 1.41257777e-03 -3.41022082e-03 6.16535822e+01
1716.lowfreq: -1.6905 -0.0004 -0.0003 0.0003 5.9149 9.4123 26.1677 71.6076 84.1631
frequency: 26.1633 71.6076 84.1603 86.1675 96.0679 131.2448 155.8387 185.2020 204.6017 252.1519 288.4238 330.8425 345.0099 431.0415 432.8764 446.0429 462.3397 470.5766 513.9950 537.2018 577.6596 603.8356 638.7606 660.9449 717.2613 741.8851 762.7994 770.4585 815.1147 838.9366 884.3630 888.8402 933.5996 958.1827 958.1907 988.3516 1051.6158 1055.5600 1055.5669 1140.1940 1143.3019 1221.4883 1234.7160 1275.1318 1291.5404 1349.2121 1365.8266 1380.0883 1420.6242 1421.5897 1440.1631 1466.1274 1559.5405 1562.2257 1593.4131 1606.4959 2038.5066 3139.2529 3141.9303 3152.7206 3153.4073 3170.5830 3171.2446
redmass: 15.4060 15.5247 6.9140 15.0482 6.4620 51.9911 4.1996 8.1068 6.8983 11.5366 5.6419 6.0587 5.6020 3.2357 9.6318 3.3116 7.8178 10.1116 7.8869 5.6061 3.6730 5.6778 7.3657 9.0540 6.3498 4.2134 2.6820 7.8641 1.3053 1.7884 1.4483 1.5111 8.4803 1.4157 1.3514 6.9115 2.4453 1.8842 4.8414 1.4836 1.6022 3.0292 1.7580 1.3447 1.8536 2.5883 7.3111 11.7204 3.1223 4.0881 3.1796 5.1549 8.1245 7.3198 7.8474 7.4937 13.8722 1.0896 1.0895 1.0928 1.0929 1.0957 1.0959
irintensity: 0.0063 0.0215 0.0000 0.3601 0.1448 0.0418 0.0000 0.2161 0.0363 6.5838 0.0014 1.2373 0.0000 24.4063 0.4051 0.0000 0.0859 1.5148 0.0536 0.6059 0.0000 9.7261 1.1502 64.9215 0.0075 6.1925 0.0000 0.1052 90.1309 0.0000 0.0001 34.7610 87.8347 0.0000 0.6532 20.7912 1.1960 45.7204 3.6425 2.9048 0.0128 0.0069 21.5104 9.0573 1.8328 0.5126 34.4157 0.1385 107.0364 43.4269 43.9659 84.2673 12.1596 0.2807 84.2660 0.9843 601.6921 2.2621 7.9786 0.0116 2.1395 1.0088 10.3284
temp: 298.150 k
press: 1.00000 atm
elementType: 53 53 7 7 6 6 6 6 6 6 6 6 6 6 6 6 6 1 1 1 1 1 1
symmnumber: 1
zpe: 394126.5 jmol-1
zpe.correction: 0.150115 hartree
zpe.thermalcorrener: 0.164407 hartree
zpe.thermalcorrenthalpy: 0.165351 hartree
zpe.thermalcorrgfe: 0.105202 hartree
zpe.sumelectzpe: -630.337793 hartree
zpe.sumelectthermal: -630.323501 hartree
zpe.sumelectthermalent: -630.322557 hartree
zpe.sumelectthermalfe: -630.382705 hartree
dipole: 0.0001 -1.4552 0.0001
dipole: 1.4552
quadrupole: -132.3483 -118.1090 -132.4460
quadrupole: 0.0004 0.0004 -0.0010
quadrupole: -4.7139 9.5254 -4.8115 0.0004 0.0004 -0.0010
hfenergy: -630.4879078 hartree
pointgroup: C01 [X(C13H6I2N2)]
dipole: -0.0000403 -0.572533 -0.0000341 debye
dipolederiv: -0.651474 0.040307 0.000021 0.1334092 -0.0247753 0. 0.0000744 -0.0000727 0.0047983 -0.6515994 -0.0398873 -0.000052 -0.1334379 -0.0252042 0.0000123 -0.0000413 -0.0000651 0.004751 -0.2754457 0.0002596 -0.0000084 -0.0007319 2.3205231 0.0000271 -0.0001463 -0.0000223 0.1212468 -0.0228715 -0.0001978 0.0000061 0.000538 -1.5561275 -0.0000073 0.0000305 -0.00004 -0.0756685 0.2106087 0.2940861 0.0000153 -0.2605539 -0.1711478 0.0000023 0.0000248 -0.000002 -0.0018437 0.2106981 -0.2942763 -0.000015 0.2604778 -0.1707593 0.0000231 0.0000325 0.000027 -0.0018548 0.1255312 0.4702814 -0.0000166 0.4352461 0.3436638 -0.000005 -0.0001032 -0.0000706 0.0503385 0.1255451 -0.4700234 0.0000169 -0.4353012 0.343597 -0.00002 -0.0000821 -0.0000843 0.0503415 -0.0964457 0.0001971 -0.0000005 0.0001214 -1.0858271 -0.0000129 0.0002027 0.0001276 -0.0567374 0.1309131 -0.154444 -0.0000546 0.1547708 0.080885 0.0000469 -0.0000119 0.0000232 -0.139092 0.1309358 0.1548237 0.0000433 -0.1537695 0.0806411 -0.000024 -0.0000086 0.0000258 -0.1390929 -0.4919215 -0.2457248 0.0000171 0.0420709 -0.0364163 -0.0000403 0.0000919 0.0000338 -0.1155115 -0.4920305 0.2454142 0.0000023 -0.0424375 -0.0362635 -0.0000334 -0.0000002 0.0000223 -0.1155191 -0.5968031 0.2208629 0.0000616 0.1637775 -0.1293452 0.0000471 0.0000681 0.0000226 -0.1109751 -0.5969837 -0.220447 -0.0000538 -0.1633168 -0.1294134 0.0000133 0.000034 -0.0000105 -0.1109646 1.3337538 -0.0870963 -0.0000667 -0.374085 0.1653467 0.0000036 -0.0001752 0.0000807 -0.1718156 1.3339438 0.0862266 0.0000882 0.3743078 0.1656189 0.0000312 0.0000286 0.0000311 -0.171774 0.0345646 0.0800756 0.0000124 0.0437078 -0.0580082 -0.0000598 -0.000001 -0.0000238 0.1567349 0.0343705 -0.0801051 -0.0000038 -0.0446509 -0.0578802 0.0000029 -0.0000143 -0.0000144 0.1567353 0.0928502 0.0044912 -0.0000044 0.0534376 -0.0273024 0.0000118 -0.0000072 -0.0000073 0.1679514 0.0928695 -0.0046419 -0.0000066 -0.0533149 -0.0276531 -0.0000041 0.0000331 0.0000386 0.167953 0.0093817 -0.0865418 -0.0000078 -0.0814175 0.0177656 -0.0000056 -0.0000114 -0.0000267 0.1649994 0.0096089 0.0863603 0.000006 0.0811522 0.0180821 -0.0000093 -0.0000178 0.0000069 0.164999 unknown
polarizability: 411.7045655|-0.0213565|223.401179|0.0014126|0.0034102|61.6535822 unknown
InChI: InChI=1S/C13H6I2N2/c14-7-1-3-9-10-4-2-8(15)6-12(10)13(17-16)11(9)5-7/h1-6H
charge 0 multiplicity 1
23 atoms
I  -5.595156 0.078003 0.000075
I  5.59513 0.077915 0.000138
N  0.000049 2.593203 0.000033
N  0.000214 3.77591 0.000052
C  -0.733644 -0.9518 -0.000086
C  0.733595 -0.951837 -0.000067
C  -1.193408 0.410756 -0.000021
C  1.193409 0.41072 0.000006
C  0.000006 1.270911 0.00003
C  -1.676918 -2.001031 -0.000158
C  1.676842 -2.001079 -0.000059
C  -2.567965 0.72855 0.000024
C  2.567959 0.728488 0.00007
C  -3.057725 -1.697764 -0.000128
C  3.057669 -1.697839 -0.000017
C  -3.4866 -0.345453 -0.000025
C  3.486573 -0.345552 0.000048
H  -1.358334 -3.048789 -0.000243
H  1.358259 -3.048839 -0.00009
H  -2.917186 1.765667 0.000074
H  2.917221 1.765587 0.000137
H  -3.79405 -2.506309 -0.000206
H  3.793958 -2.506418 0.000014
