program: Gaussian 09
title: 000125204
version: EM64L-G09RevD.01
frameworkgroup: C1[X(C10H10Cl3NO2)]
method: RPBEPBE
basis: SDD
operation: Freq
keyword: #p
keyword: freq=noraman
keyword: PBEPBE/SDD
title: #p freq=noraman PBEPBE/SDD
converged: YES YES NO NO
title: Mulliken charges:
elementType: Cl Cl Cl O O N C C C C C C C C C C H H H H H H H H H H
charge: 0.001380 -0.007167 0.042306 -0.416794 -0.192416 -0.475840 0.101077 0.180502 -0.695044 -0.695432 0.590976 -0.506416 -0.327400 -0.044891 -0.015015 -0.134356 0.196007 0.217497 0.264199 0.217969 0.194253 0.264158 0.306009 0.338273 0.254892 0.341270
chargesum: 0.00000
title: Mulliken charges with hydrogens summed into heavy atoms:
elementType: Cl Cl Cl O O N C C C C C C C C C C
charge: 0.001380 -0.007167 0.042306 -0.078521 -0.192416 -0.169831 0.101077 0.180502 -0.017341 -0.019052 0.590976 -0.251523 0.013870 -0.044891 -0.015015 -0.134356
polarizability: 2.32523834e+02 -1.05325659e+00 1.67510803e+02 4.67015177e-02 -4.66421444e-02 7.64934836e+01
1716.lowfreq: -5.5208 -0.0008 0.0006 0.0018 3.9972 6.7700 29.4980 47.4860 55.7376
frequency: 28.1852 47.0067 55.7158 78.5513 84.7398 163.3383 164.9279 191.1172 201.1230 201.1972 214.4117 229.7669 241.8699 256.0104 268.6851 309.0398 331.3989 341.6116 351.5850 413.6241 416.7814 437.1439 493.4094 503.4754 510.1363 584.0787 592.3940 636.2142 662.4010 695.0191 718.4332 756.2699 810.4793 853.2952 897.5800 910.3375 911.8433 917.9044 948.3644 1000.0215 1001.7358 1075.1938 1140.5010 1160.8378 1172.1817 1175.8308 1192.7311 1267.1502 1319.3113 1342.7947 1386.0526 1386.7714 1406.4843 1439.6943 1453.9465 1464.8875 1473.8892 1474.7245 1492.5916 1570.4544 1599.0532 1641.6734 2976.9267 2980.3867 3061.7506 3069.5697 3097.5234 3100.4104 3150.1949 3199.9401 3536.1911 3550.8901
redmass: 3.9168 6.3228 9.6021 13.7502 7.6114 4.9132 7.5023 13.1507 5.1392 9.7242 1.2139 4.1129 1.0646 1.3009 2.9010 3.0648 16.0376 5.1253 6.4008 4.8678 3.7374 4.7923 7.6140 6.2843 5.1619 3.7161 3.0864 1.3789 6.5379 3.5650 7.0975 10.4573 4.0972 1.5957 5.1750 1.5472 5.3357 1.4023 2.3598 1.2960 5.6258 1.5816 1.7826 2.6273 3.8353 2.5893 1.6034 2.6255 1.8673 4.2365 1.2906 4.0938 1.2188 3.5609 1.0498 1.0550 1.2669 1.0724 1.8188 4.4906 6.7968 6.1866 1.0368 1.0369 1.0990 1.0979 1.0996 1.0998 1.0926 1.0934 1.0758 1.0658
irintensity: 3.0361 0.1541 3.1893 0.3381 2.7143 0.2720 0.0206 0.3432 0.0135 0.0200 2.8323 0.9363 144.6522 0.7315 3.5219 0.0455 0.2473 0.0456 3.5490 8.6745 8.8147 9.7327 23.6009 12.2012 0.8602 9.5593 30.0609 52.0767 1.8934 8.6839 3.8226 74.0411 14.8028 35.3653 25.2618 0.0824 2.6304 32.7232 15.4841 0.4448 2.5237 275.9303 52.3418 33.9671 27.5337 28.4947 5.6856 4.3137 8.7170 159.7591 19.6174 21.2750 12.2871 159.7892 0.6887 4.1213 73.5346 26.9858 330.2421 187.4759 131.0579 100.2412 10.2725 29.3582 0.1229 105.9787 10.8832 17.6780 3.4430 26.2831 11.6709 5.7155
temp: 298.150 k
press: 1.00000 atm
elementType: 17 17 17 8 8 7 6 6 6 6 6 6 6 6 6 6 1 1 1 1 1 1 1 1 1 1
symmnumber: 1
zpe: 477260.7 jmol-1
zpe.correction: 0.181779 hartree
zpe.thermalcorrener: 0.198777 hartree
zpe.thermalcorrenthalpy: 0.199721 hartree
zpe.thermalcorrgfe: 0.135794 hartree
zpe.sumelectzpe: -1971.249169 hartree
zpe.sumelectthermal: -1971.232172 hartree
zpe.sumelectthermalent: -1971.231228 hartree
zpe.sumelectthermalfe: -1971.295155 hartree
dipole: -4.9526 -5.5587 0.0818
dipole: 7.4454
quadrupole: -102.6376 -119.7413 -114.8657
quadrupole: 18.5414 -0.3484 0.1462
quadrupole: 9.7773 -7.3264 -2.4508 18.5414 -0.3484 0.1462
hfenergy: -1971.4309484 hartree
pointgroup: C01 [X(C10H10Cl3N1O2)]
dipole: 1.9173178 -2.2142224 0.0403635 debye
dipolederiv: -0.1643642 0.2013431 -0.0066928 0.2629804 -0.6386212 0.0204439 -0.009022 0.0204781 -0.0292797 -0.2893438 -0.2786693 0.0099492 -0.3420582 -0.5336008 0.0177206 0.0121315 0.0176086 -0.0336788 -0.7576425 0.0662547 -0.0018893 0.0826033 -0.0105504 0.0006322 -0.0026445 0.0005801 0.0090164 -0.5223263 -0.3453771 0.0008444 -0.3725766 -0.4403441 -0.0007387 0.0002349 -0.0015919 -0.6288456 -0.6345872 0.1674241 -0.0026078 -0.4583327 -0.8529704 0.0149537 0.0156414 0.0163933 -0.2813945 -2.0755821 -0.2208785 0.0099914 -0.4281529 -0.4246987 0.004868 0.0122424 0.0041793 -0.3048382 0.4138712 0.259952 -0.0008403 0.4043283 0.2809538 0.0015663 0.004014 0.0009826 0.4959163 1.7177139 0.0266792 -0.0094578 0.957241 1.1284773 -0.0267626 -0.0373035 -0.0274184 0.0974244 -0.0833275 0.0234192 0.0378024 -0.0130842 -0.0348815 -0.0432885 -0.0894919 -0.0612385 -0.130876 -0.0798817 0.0243134 -0.0367991 -0.0084351 -0.0324062 0.0427544 0.0853516 0.0617031 -0.1326137 1.5360688 -0.0215729 -0.0011769 -0.3162629 0.1830768 -0.0020491 0.0074966 -0.0027177 0.1193447 -0.4972515 -0.0778504 0.0033477 -0.2400228 -0.2146089 0.0013821 0.0084223 0.0013232 -0.1787532 -0.4832641 0.1099254 -0.0032039 0.2706881 -0.2962209 0.0055208 -0.0077767 0.006212 -0.1225199 0.2633526 -0.2721556 0.008656 -0.3444635 1.0404001 -0.0352855 0.0118889 -0.0352872 -0.013273 0.4033817 0.3900241 -0.0141255 0.4828585 0.8762626 -0.0308778 -0.0177072 -0.0310771 0.0003586 0.8211514 -0.1612408 0.005557 -0.1540579 -0.4764974 0.0138104 0.0054086 0.013956 -0.0777568 -0.0121707 -0.1446673 -0.0073228 -0.1622082 -0.0532988 -0.0307237 -0.005157 0.0012951 0.0677275 -0.185743 0.0998569 0.0147011 0.1034158 0.0543364 -0.0248868 -0.0005508 -0.0119065 0.0746818 0.1240014 0.0194908 -0.025544 -0.0016805 0.0338227 0.0978464 -0.0260536 0.0551569 -0.05717 -0.1871073 0.0987008 -0.0175398 0.1002423 0.0566919 0.0252421 -0.0008126 0.0124575 0.0749454 -0.0132605 -0.1460197 0.007836 -0.1649556 -0.0558921 0.031025 0.005484 0.0002277 0.0661271 0.1230423 0.0200134 0.0273274 0.0005925 0.0318319 -0.0983335 0.0283979 -0.0562983 -0.0560212 0.2265941 -0.0074433 0.0020333 0.0105734 0.0727941 0.0061403 0.0034987 0.0055418 0.3032099 0.0994172 0.1332234 0.0003737 0.241142 0.1978541 0.0003254 -0.0012713 0.0009299 0.3812764 0.0332514 0.0747229 -0.0024466 0.0739916 0.0009964 0.0059487 -0.0021749 0.006089 0.1731394 0.2240066 -0.0394685 0.0012268 0.0156339 0.1070934 0.002766 -0.0002468 0.0024212 0.1838526 unknown
polarizability: 232.5404368|0.1268171|167.391947|-0.1807795|-3.046289|76.5957363 unknown
InChI: InChI=1S/C10H10Cl3NO2/c1-10(2,16)9(15)14-5-3-6(11)8(13)7(12)4-5/h3-4,14,16H,1-2H3
charge 0 multiplicity 1
26 atoms
Cl -2.876055 2.87104 -0.092763
Cl -3.554794 -2.687085 0.09795
Cl -4.875189 0.297153 -0.005172
O  4.528434 0.913991 -0.003183
O  1.991147 1.674936 -0.044866
N  1.140432 -0.505168 0.018241
C  3.60116 -0.225537 0.002079
C  2.184834 0.434903 -0.009684
C  3.816724 -1.073917 -1.279237
C  3.813551 -1.056375 1.295419
C  -0.257065 -0.260941 0.011706
C  -1.118064 -1.389295 0.051035
C  -0.813275 1.044287 -0.032287
C  -2.211413 1.189257 -0.036405
C  -2.510081 -1.208591 0.045646
C  -3.089834 0.080599 0.001722
H  3.118073 -1.927476 -1.358897
H  4.842538 -1.489134 -1.283729
H  3.695291 -0.439724 -2.173677
H  4.843118 -1.46179 1.311867
H  3.124322 -1.917133 1.381162
H  3.680337 -0.413138 2.181633
H  1.41116 -1.49025 0.048219
H  5.452993 0.554254 -0.004799
H  -0.714405 -2.406429 0.086178
H  -0.15844 1.915763 -0.061757
