program: Gaussian 09
title: 000125203
version: EM64L-G09RevD.01
frameworkgroup: C1[X(C5H14N3O7PS)]
method: RPBEPBE
basis: SDD
operation: Freq
keyword: #p
keyword: freq=noraman
keyword: PBEPBE/SDD
title: #p freq=noraman PBEPBE/SDD
converged: YES YES NO NO
title: Mulliken charges:
elementType: S P O O O O O O O N N N C C C C C H H H H H H H H H H H H H H
charge: 1.192051 1.374299 -0.599554 -0.683983 -0.568131 -0.409587 -0.238543 -0.457821 -0.546868 -0.754202 -0.648239 -0.729806 -0.344584 -0.348437 -0.320227 -0.182282 0.151074 0.229256 0.222533 0.203218 0.229614 0.224349 0.249111 0.258751 0.357927 0.316889 0.280994 0.421217 0.386345 0.372297 0.362335
chargesum: 0.00000
title: Mulliken charges with hydrogens summed into heavy atoms:
elementType: S P O O O O O O O N N N C C C C C
charge: 1.192051 1.374299 -0.599554 -0.262766 -0.568131 -0.023241 -0.238543 -0.457821 -0.546868 -0.396275 -0.050355 0.004827 0.107205 0.084396 0.153233 0.076469 0.151074
polarizability: 2.57104931e+02 -9.54542321e-01 1.33119964e+02 6.07528201e+00 3.24892384e+00 1.33131715e+02
1716.lowfreq: -10.3319 -5.3790 -2.0398 -0.0025 -0.0019 -0.0017 7.6490 19.1798 28.0497
frequency: 6.5041 19.1506 28.0279 42.7277 49.2597 52.3073 73.5841 77.1480 122.2759 136.7717 151.9489 169.7284 183.4903 188.4946 191.9167 218.0203 249.8255 264.5879 281.5655 295.9464 321.1171 326.2035 343.7725 350.2109 364.6378 375.1474 406.0800 442.2348 466.5165 492.2235 501.6157 512.9064 543.9832 550.3402 580.2510 631.6676 643.8057 711.5578 715.4422 729.9993 755.0630 793.4492 820.8973 839.5072 860.0375 927.8375 940.6070 1034.9710 1049.2305 1051.7149 1060.3231 1081.9367 1086.5600 1110.5175 1134.6211 1173.0777 1190.8597 1199.7408 1216.3351 1268.0338 1279.3515 1293.4007 1298.7741 1351.5565 1364.7304 1382.0534 1404.3989 1455.4969 1469.5958 1484.1828 1535.3225 1610.6074 1663.9776 2927.8286 2977.1316 2983.3497 2992.2727 3033.9981 3053.5468 3069.7582 3256.4242 3468.3260 3491.0959 3518.7797 3558.9205 3635.9740 3649.4489
redmass: 7.5434 7.1010 7.2469 7.9267 6.7804 6.9542 6.4741 2.8081 3.1091 2.9720 5.4994 3.7940 1.9446 2.0402 1.9358 4.4137 3.1572 4.1659 5.1593 4.3646 4.7566 4.3297 3.4548 2.6357 4.2357 5.6043 4.6802 3.8568 4.7354 2.8525 3.4808 1.8594 7.6019 2.3829 1.5993 1.5408 1.1960 4.5396 4.5375 5.4332 1.2191 3.5677 3.5776 7.8928 1.6653 3.3049 2.4601 2.2076 3.9470 2.7170 3.8660 1.7326 2.3315 4.1844 1.5238 1.3575 1.2536 1.5923 1.4636 1.5226 1.2511 1.1010 1.3626 1.2672 1.4529 1.8001 1.3197 1.0944 1.0693 1.0889 1.0857 1.4112 3.2011 1.0814 1.0611 1.0615 1.0613 1.0980 1.1012 1.1047 1.0668 1.0403 1.0468 1.0642 1.0765 1.0985 1.1069
irintensity: 1.9967 1.9692 1.8387 2.9962 0.3923 0.7001 0.0199 0.4171 1.8428 23.2090 0.5796 2.5733 17.6575 7.9019 26.0654 4.3344 8.3541 29.0081 22.1458 39.4538 8.1174 11.0093 79.8229 21.0597 32.9768 200.9542 40.9534 26.5517 21.3783 164.1413 288.2772 21.1099 49.0816 131.2501 23.7762 216.8976 167.6622 98.1625 18.1450 42.0961 33.6188 3.7560 25.2693 197.2114 6.9268 62.1011 1.2511 7.9573 3.9663 275.6069 30.4997 80.7408 57.1283 94.1776 14.9098 47.9485 53.3567 22.2229 55.9179 9.8635 11.4914 1.5636 9.0702 0.9068 6.1553 5.7798 31.1130 4.0821 4.3777 17.7337 31.6947 197.5466 115.6182 42.4613 12.4067 9.3881 76.3125 4.3816 1.8157 47.1957 172.7865 110.4275 20.1466 30.9369 58.6501 18.9953 62.6454
temp: 298.150 k
press: 1.00000 atm
elementType: 16 15 8 8 8 8 8 8 8 7 7 7 6 6 6 6 6 1 1 1 1 1 1 1 1 1 1 1 1 1 1
symmnumber: 1
zpe: 583889.0 jmol-1
zpe.correction: 0.222392 hartree
zpe.thermalcorrener: 0.244424 hartree
zpe.thermalcorrenthalpy: 0.245368 hartree
zpe.thermalcorrgfe: 0.167077 hartree
zpe.sumelectzpe: -1627.472836 hartree
zpe.sumelectthermal: -1627.450803 hartree
zpe.sumelectthermalent: -1627.449859 hartree
zpe.sumelectthermalfe: -1627.528150 hartree
dipole: 3.0112 6.8932 0.9833
dipole: 7.5861
quadrupole: -107.1595 -105.3610 -125.0641
quadrupole: -16.6871 -16.2432 0.7762
quadrupole: 5.3687 7.1672 -12.5359 -16.6871 -16.2432 0.7762
hfenergy: -1627.6952272 hartree
pointgroup: C01 [X(C5H14N3O7P1S1)]
dipole: 1.1953749 -2.5393926 -1.0151302 debye
polarizability: 256.5191695|4.4130238|131.8263879|-9.5629896|2.6980676|135.0110528 unknown
InChI: InChI=1S/C5H14N3O7PS/c6-4(5(9)10)2-1-3-8-16(11,12)15-17(7,13)14/h4,8-9,11H,1-3,6-7H2
charge 0 multiplicity 1
31 atoms
S  -4.975374 -0.170041 0.211174
P  -1.837516 0.508831 0.184309
O  -3.179933 -0.720359 0.232766
O  -2.278249 1.398016 -1.208077
O  -1.603682 1.228602 1.575759
O  4.639429 1.461495 1.047951
O  5.045741 1.295887 -1.231539
O  -5.615901 -0.100926 1.677486
O  -5.010762 1.091978 -0.817077
N  -0.545107 -0.416207 -0.408053
N  4.611878 -1.428795 -1.228305
N  -5.710858 -1.52955 -0.60426
C  1.932905 -0.44439 -0.12099
C  3.099101 -0.971771 0.737515
C  0.568117 -0.900102 0.435356
C  4.492177 -0.745886 0.061997
C  4.756534 0.746907 -0.144755
H  1.948527 0.661491 -0.164025
H  2.070229 -0.823355 -1.1532
H  2.990376 -2.064341 0.886289
H  3.10204 -0.493414 1.7348
H  0.535677 -2.006184 0.499455
H  0.413941 -0.499755 1.454294
H  5.258773 -1.086346 0.79483
H  -0.54397 -0.659395 -1.400915
H  4.922167 -0.831194 -1.999259
H  5.036446 -2.355246 -1.204726
H  -3.266511 1.602312 -1.241984
H  4.810876 2.427096 0.877799
H  -5.921406 -2.32638 0.004035
H  -5.376665 -1.700478 -1.556849
