program: Gaussian 09
title: 000125188
version: EM64L-G09RevD.01
frameworkgroup: C1[X(C13H18ClN5O6)]
method: RPBEPBE
basis: SDD
operation: Freq
keyword: #p
keyword: freq=noraman
keyword: PBEPBE/SDD
title: #p freq=noraman PBEPBE/SDD
converged: NO YES NO NO
title: Mulliken charges:
elementType: Cl O O O O O O N N N N N C C C C C C C C C C C C C H H H H H H H H H H H H H H H H H H
charge: -0.034403 -0.251042 -0.434013 -0.277144 -0.264083 -0.244559 -0.222041 -0.180514 -0.387438 -0.397565 -0.186376 0.043433 -0.156006 -0.516792 -0.106304 -0.030169 -0.358867 -0.227287 0.205865 0.332626 0.224912 0.089008 -0.769258 -0.335407 -0.569792 0.277065 0.296735 0.249946 0.252780 0.280625 0.231032 0.237151 0.357693 0.330011 0.349214 0.358957 0.244093 0.226369 0.243047 0.272485 0.277009 0.279140 0.289864
chargesum: 0.00000
title: Mulliken charges with hydrogens summed into heavy atoms:
elementType: Cl O O O O O O N N N N N C C C C C C C C C C C C C
charge: -0.034403 -0.251042 -0.084798 -0.277144 -0.264083 -0.244559 -0.222041 -0.180514 -0.029744 -0.038608 -0.186376 0.043433 0.121059 0.029890 0.146476 0.250455 0.109316 0.102724 0.205865 0.332626 0.224912 0.089008 -0.055749 0.214087 -0.000789
polarizability: 3.06794168e+02 -9.45945876e+00 1.88734103e+02 3.72760176e-01 -5.54736113e+00 1.42330869e+02
1716.lowfreq: -14.2796 -13.3349 -4.4169 -0.8515 -0.0014 -0.0007 0.0003 11.1661 21.9461
frequency: -13.3367 10.2024 21.9200 23.1185 40.6622 50.7374 57.2883 67.8091 80.6125 103.1433 117.4439 122.8304 129.7862 148.9548 157.2206 165.8922 194.0415 201.6472 217.1806 241.9096 267.1455 276.4877 294.4874 311.3387 317.4725 326.1037 348.4148 366.5217 379.7278 416.0002 433.6695 444.8160 456.2239 465.6260 523.7646 533.4915 556.9309 608.6419 655.1012 688.0125 696.3299 702.4987 703.8935 711.3460 713.6427 716.2118 743.1166 756.2019 777.3347 792.8317 806.0057 830.0603 840.4724 898.8992 916.5389 928.6923 951.4897 955.1660 961.7216 989.9565 1015.0332 1034.6558 1045.0843 1052.0152 1055.2683 1059.0315 1068.6891 1084.0269 1094.9178 1131.1290 1142.2180 1162.5062 1193.7321 1210.6158 1225.6138 1234.5926 1246.1774 1253.8945 1259.1359 1267.1413 1280.8652 1298.0640 1322.1476 1324.4454 1337.1958 1342.0069 1358.7828 1371.2165 1373.1024 1377.8942 1380.3201 1382.6494 1404.8597 1415.6679 1435.4115 1452.9955 1455.4153 1463.3395 1468.0514 1472.5766 1494.3833 1613.4676 1626.2222 1650.5271 1657.1207 2968.3567 2987.0581 3041.2161 3044.1942 3045.9932 3054.3459 3066.1737 3067.4924 3068.6533 3078.1235 3100.2634 3120.4626 3122.7070 3143.2202 3158.1503 3492.0751 3524.0892 3566.7410
redmass: 5.5991 6.2805 6.2811 5.8032 6.1321 9.8098 4.3725 5.7643 5.9107 2.4096 1.6112 3.6479 5.2718 5.3363 4.1529 5.3403 3.6653 5.6126 8.1877 7.1653 4.4139 4.0623 4.3737 6.0373 1.4227 2.9800 4.1766 6.6665 9.4594 3.2249 6.5776 3.7125 10.7369 6.3612 3.5276 3.8724 5.6346 4.7773 3.6794 2.1374 2.4483 2.5240 2.6056 5.3984 6.6019 5.7257 4.2470 2.2072 2.3114 2.6875 3.9600 3.5258 3.9570 2.7216 2.3685 2.9610 3.0197 1.3801 3.2839 2.1621 1.7649 2.9712 2.1958 2.2368 1.9023 2.4770 2.7335 2.6785 3.5125 4.9959 2.1243 1.3230 1.5210 1.7115 2.0093 2.9789 1.4882 1.9170 2.0611 1.1896 1.4963 1.4933 1.2942 1.2289 1.2712 1.7303 1.2691 1.6565 1.6807 1.3498 1.6544 3.1757 1.2641 2.9603 1.1230 1.0456 1.0926 1.0797 1.0900 1.0803 1.9056 5.2922 11.1540 9.6877 5.9048 1.0674 1.0364 1.0800 1.0730 1.0592 1.0878 1.0973 1.0855 1.0557 1.0959 1.1006 1.1049 1.1017 1.0961 1.1129 1.0777 1.0770 1.0663
irintensity: 0.7124 0.9744 0.2128 1.3060 0.4512 2.2777 1.3981 0.3480 4.8526 2.2478 1.3196 1.6101 1.1267 7.9106 12.8411 1.9472 9.2452 3.0011 4.4659 1.2279 12.2319 14.1998 8.5123 3.0638 133.0151 12.1885 25.8609 18.3778 12.4067 26.9992 10.6881 4.7127 1.0604 10.6865 28.5611 8.3147 7.4811 2.7198 8.2970 38.7075 47.1590 18.8192 17.8139 8.8042 51.7609 7.3086 12.9928 15.6137 105.4404 36.2132 72.2769 4.7601 9.3610 98.7149 38.3284 32.0217 85.7298 22.8107 19.3541 28.7837 6.9516 62.8727 45.4020 15.1525 20.9147 90.4557 9.3479 0.0665 95.0742 19.9510 20.7348 5.4270 38.0081 4.4149 37.8468 27.9807 78.6584 136.7090 91.8213 7.9626 8.2744 60.8837 6.1946 9.3412 31.0368 45.5292 6.6809 140.0348 16.6888 33.0190 15.6719 67.5589 25.4318 70.5316 23.1827 12.4754 9.2194 13.6604 28.5611 4.8354 550.4924 207.1306 271.7181 354.5762 481.8940 40.7973 21.7936 14.4305 4.0645 1.3576 8.4586 14.5830 6.9408 13.0031 34.5659 12.4307 1.3840 7.8781 57.2208 2.7240 45.7882 58.2440 11.8606
temp: 298.150 k
press: 1.00000 atm
elementType: 17 8 8 8 8 8 8 7 7 7 7 7 6 6 6 6 6 6 6 6 6 6 6 6 6 1 1 1 1 1 1 1 1 1 1 1 1 1 1 1 1 1 1
symmnumber: 1
zpe: 852089.9 jmol-1
zpe.correction: 0.324544 hartree
zpe.thermalcorrener: 0.349109 hartree
zpe.thermalcorrenthalpy: 0.350053 hartree
zpe.thermalcorrgfe: 0.266358 hartree
zpe.sumelectzpe: -1689.421508 hartree
zpe.sumelectthermal: -1689.396943 hartree
zpe.sumelectthermalent: -1689.395999 hartree
zpe.sumelectthermalfe: -1689.479694 hartree
dipole: 2.5421 3.5101 0.4473
dipole: 4.3569
quadrupole: -216.8601 -156.4847 -156.5519
quadrupole: -4.6019 -1.4995 8.7978
quadrupole: -40.2279 20.1475 20.0803 -4.6019 -1.4995 8.7978
hfenergy: -1689.7460517 hartree
pointgroup: C01 [X(C13H18Cl1N5O6)]
dipole: 0.9699538 1.4132475 -0.0146664 debye
polarizability: 307.1467985|-6.7523577|186.0522902|1.5347961|-11.5118538|144.6600509 unknown
InChI: InChI=1S/C13H18ClN5O6/c1-7-5-18(12(22)16-11(7)21)10-4-8(9(6-20)25-10)15-13(23)19(17-24)3-2-14/h5,8-10,15-16,20H,2-4,6H2,1H3
charge 0 multiplicity 1
43 atoms
Cl 8.156941 0.902107 -0.498124
O  -0.743097 0.746956 1.056368
O  -1.562286 3.346426 0.0387
O  -2.522659 -2.808704 -0.141748
O  3.500324 0.726333 -1.682991
O  -6.714164 -0.729102 -0.396083
O  4.949758 -1.712815 1.944463
N  -2.653042 -0.491639 0.2077
N  1.996051 -0.161787 -0.114769
N  -4.606534 -1.723577 -0.249323
N  4.329774 -0.542943 0.11279
N  3.973309 -1.218889 1.2934
C  0.790269 0.37991 -0.755647
C  -0.344057 -0.676531 -0.864087
C  0.123045 1.492276 0.099588
C  -1.170088 -0.509003 0.444456
C  -0.670039 2.501699 -0.758532
C  -3.422554 0.673764 0.295198
C  -3.221035 -1.754224 -0.065765
C  3.243497 0.062086 -0.640771
C  -4.786025 0.680189 0.099346
C  -5.472861 -0.585323 -0.197007
C  -5.616759 1.936767 0.187435
C  5.725166 -0.436566 -0.370479
C  6.387246 0.854552 0.139564
H  1.100446 0.759302 -1.743955
H  0.041334 -1.700844 -0.970687
H  -0.979343 -0.465712 -1.740756
H  0.854178 2.023806 0.734837
H  -0.981754 -1.325466 1.16136
H  0.053634 3.111947 -1.339477
H  -1.340697 1.989588 -1.468548
H  1.931528 -0.702629 0.754271
H  -2.868149 1.585185 0.541351
H  -1.041187 3.833194 0.726233
H  -5.050819 -2.62576 -0.448574
H  -6.19418 2.088318 -0.742497
H  -4.98137 2.821541 0.360372
H  -6.358041 1.862354 1.004129
H  6.271152 -1.318685 0.004618
H  5.703258 -0.439701 -1.470828
H  6.459004 0.885394 1.236189
H  5.895528 1.752205 -0.26082
