program: Gaussian 09
title: 000125181
version: EM64L-G09RevD.01
frameworkgroup: C1[X(C8H10O6)]
method: RPBEPBE
basis: SDD
operation: Freq
keyword: #pfreq=noraman
keyword: PBEPBE/SDD
title: #p freq=noraman PBEPBE/SDD
converged: YES YES NO NO
title: Mulliken charges:
elementType: O O O O O O C C C C C C C C H H H H H H H H H H
charge: -0.221849 -0.178110 -0.410100 -0.238711 -0.402912 -0.243118 -0.515360 -0.622789 0.246094 -0.479146 0.219319 -0.581423 0.186710 0.217693 0.285424 0.258888 0.261397 0.308158 0.266067 0.282992 0.287405 0.310124 0.380651 0.382599
chargesum: 0.00000
title: Mulliken charges with hydrogens summed into heavy atoms:
elementType: O O O O O O C C C C C C C C
charge: -0.221849 -0.178110 -0.029449 -0.238711 -0.020313 -0.243118 0.028952 -0.053235 0.246094 0.069913 0.219319 0.016105 0.186710 0.217693
polarizability: 1.39559267e+02 1.35349632e+00 8.97767052e+01 5.01165072e+00 2.68745649e+00 8.96601885e+01
1716.lowfreq: -5.6293 -4.8148 -0.0008 -0.0002 0.0005 8.7254 12.1802 23.1965 28.2702
frequency: 11.2284 23.1622 28.2197 49.3269 54.0000 73.1046 87.9391 129.9162 166.0327 186.9206 267.5173 273.8139 351.0958 395.1315 454.9243 457.3229 482.4430 506.0757 520.2818 549.5591 577.7376 611.8879 647.6998 662.8387 688.9943 754.4731 795.5535 845.1451 885.4227 908.2333 920.5396 972.8755 1011.0634 1027.5307 1054.5852 1072.4870 1102.4648 1138.3993 1154.8446 1181.4027 1224.6589 1240.4656 1254.5995 1264.1771 1284.1729 1321.9289 1340.7620 1377.1945 1411.2233 1430.0055 1433.8428 1444.3441 1613.1362 1641.4856 1649.4448 1663.0277 2951.6217 2963.1290 2977.2555 3008.0171 3024.4149 3077.7500 3093.5751 3113.5458 3507.2198 3512.8821
redmass: 8.2630 7.8904 8.6822 4.1086 10.7773 3.9818 5.7542 2.9286 4.7980 4.4965 6.0664 8.2256 3.4662 2.7377 4.1726 2.9066 2.9120 2.2514 2.2955 3.4160 4.0568 2.7975 1.3639 1.7001 3.8023 2.0334 2.9873 4.3990 4.0757 3.3264 2.0603 2.3989 2.2895 3.1471 2.4796 2.2256 1.8543 1.4555 1.9453 1.2412 1.5845 1.3965 1.3529 1.5116 1.4166 1.9248 2.0529 1.9931 1.1005 1.0991 1.1046 1.0857 7.8570 8.6626 8.1734 8.1638 1.0669 1.0647 1.0628 1.0657 1.0950 1.0953 1.0954 1.0927 1.0639 1.0640
irintensity: 0.6044 2.1337 1.1318 1.5036 2.0056 2.7910 4.7512 0.4124 7.7583 22.5069 1.4467 1.5879 17.8876 6.3988 5.3656 33.2521 10.3100 56.8017 30.2966 22.4674 30.9861 41.2762 121.4970 117.3912 28.2320 9.2480 7.2432 11.1833 12.7280 0.3968 6.9112 1.5203 91.3052 65.3350 368.7849 156.7349 11.7296 9.1419 181.4528 13.5636 161.9965 7.7635 23.9216 34.4535 29.7239 189.0496 104.3431 18.0973 68.6025 37.5157 13.1701 51.3683 169.1068 204.3687 141.4760 189.6654 40.8915 55.3829 15.2575 15.7353 3.0234 4.7475 5.0367 0.8475 35.7449 27.0476
temp: 298.150 k
press: 1.00000 atm
elementType: 8 8 8 8 8 8 6 6 6 6 6 6 6 6 1 1 1 1 1 1 1 1 1 1
symmnumber: 1
zpe: 460000.5 jmol-1
zpe.correction: 0.175205 hartree
zpe.thermalcorrener: 0.190268 hartree
zpe.thermalcorrenthalpy: 0.191213 hartree
zpe.thermalcorrgfe: 0.128091 hartree
zpe.sumelectzpe: -761.134666 hartree
zpe.sumelectthermal: -761.119602 hartree
zpe.sumelectthermalent: -761.118658 hartree
zpe.sumelectthermalfe: -761.181780 hartree
dipole: 0.6632 -1.3070 -0.2891
dipole: 1.4939
quadrupole: -66.3178 -87.4728 -88.2268
quadrupole: 8.3828 -5.2931 -0.2050
quadrupole: 14.3547 -6.8004 -7.5543 8.3828 -5.2931 -0.2050
hfenergy: -761.3098705 hartree
pointgroup: C01 [X(C8H10O6)]
dipole: -0.2633282 -0.4727043 -0.2294344 debye
dipolederiv: -0.7499578 0.0670122 0.0214002 -0.1092459 -0.8560034 0.0022655 -0.0000627 0.0769927 -0.2667526 -0.5585278 -0.0359291 -0.0989558 -0.002968 -0.6528739 -0.3588902 -0.3453463 -0.3652103 -0.6577172 -0.9926047 -0.4725184 0.3075501 -0.4392647 -0.6331438 0.1112059 0.2897712 0.1050454 -0.4690752 -0.7460333 0.101678 -0.1426986 -0.1015251 -0.7075874 0.2996336 0.0127157 0.3218902 -0.5662607 -1.2568093 0.4205176 -0.0239245 0.4077385 -0.601235 0.0001797 0.0251123 -0.0541971 -0.236377 -0.7281083 0.1707987 0.0416765 0.2402071 -0.4151559 0.1158817 -0.1448841 0.1807486 -0.8839857 -0.4100327 0.1231239 -0.0151599 0.3000337 -0.0933603 0.0221931 -0.0469627 0.0541113 0.0935343 -1.0464531 -0.3140349 -0.209871 -0.2555028 -0.1501916 -0.0260626 -0.1273056 0.0106705 -0.231716 1.4021215 0.0317367 -0.0560951 0.3732822 0.9929282 0.0335188 -0.1739999 -0.1374712 0.0961899 -0.3549439 0.0469721 -0.0827832 0.2543904 -0.0391353 0.1058907 -0.1000946 0.0655153 0.0697051 1.0763144 -0.1424985 0.2528239 -0.4350673 0.7509504 0.5023528 0.6857196 0.4916657 0.6797006 -0.4119623 0.2461943 0.2670747 0.1551199 -0.2982031 -0.084598 0.2631012 -0.1141798 -0.3203041 1.5782473 0.2261591 -0.014048 0.2842978 0.9683529 -0.5687909 -0.0883658 -0.5652491 0.636497 1.585357 -0.5981082 -0.1446244 -0.601572 0.5207706 -0.1737997 -0.1647384 -0.0789173 1.2236687 0.146985 0.0103981 0.017975 -0.0950293 0.0884897 0.0504751 0.0677269 0.0647826 0.0077632 0.0436848 -0.0260305 -0.0158645 -0.0842682 0.0092273 -0.0766821 0.0185587 -0.0961979 0.0343273 0.0161318 0.0791437 -0.0102619 0.0962653 -0.0333308 -0.0016225 -0.0236573 -0.0441008 0.0922432 0.291117 -0.0419624 -0.0103341 -0.0391786 0.1245948 -0.0019737 -0.0636039 0.0006747 0.1115993 0.0608445 -0.0140172 0.011785 -0.0619591 0.0972584 0.0302087 0.0126667 0.0499407 -0.0422709 0.1613533 0.0391168 0.0063649 -0.0565904 0.0296905 -0.0657456 0.0007549 -0.0638185 0.0688201 0.0075559 0.0406693 -0.0580966 0.0431072 0.1052038 -0.0337577 -0.065756 0.0021049 0.0375406 0.300623 -0.0442967 0.0192023 0.0205797 0.1180569 -0.0186577 0.0282839 -0.0182957 0.1172829 0.2174518 0.0668831 -0.0835519 0.1107581 0.2951213 0.0949818 -0.1102493 0.0906533 0.3042155 0.3676459 0.018992 0.020417 -0.0036084 0.3795758 0.0417931 0.0506155 0.0228417 0.1013716 unknown
polarizability: 139.6951196|-3.9971099|92.3208627|2.0266386|-0.4179437|86.9801782 unknown
InChI: InChI=1S/C8H10O6/c9-5(1-2-7(11)12)3-6(10)4-8(13)14/h11,13H,1-4H2
charge 0 multiplicity 1
24 atoms
O  0.039077 -1.282082 0.024737
O  2.294673 1.665593 1.566485
O  -5.076671 -1.011961 0.198689
O  -4.338084 0.752968 -1.115588
O  4.860026 -1.137612 -0.734974
O  3.213526 -0.06487 -1.964372
C  -1.651211 0.476242 -0.085724
C  0.877115 1.002514 -0.299833
C  -0.224134 -0.054356 -0.098013
C  -2.705764 -0.615853 0.147268
C  2.061018 0.832264 0.656762
C  2.92375 -0.42105 0.481253
C  -4.077544 -0.187449 -0.331853
C  3.629586 -0.491629 -0.862332
H  -1.843596 0.992846 -1.049387
H  -1.720483 1.27499 0.679448
H  0.467367 2.018854 -0.188887
H  1.266032 0.86956 -1.332075
H  -2.767044 -0.91397 1.207694
H  -2.419677 -1.53687 -0.397771
H  3.660036 -0.490889 1.29535
H  2.236274 -1.294378 0.52422
H  -5.961875 -0.732411 -0.162151
H  5.296102 -1.199649 -1.628844
