program: Gaussian 09
title: 000125167
version: EM64L-G09RevD.01
frameworkgroup: C1[X(C9H11NO5)]
method: RPBEPBE
basis: SDD
operation: Freq
keyword: #p
keyword: freq=noraman
keyword: PBEPBE/SDD
title: #p freq=noraman PBEPBE/SDD
converged: YES YES NO NO
title: Mulliken charges:
elementType: O O O O O N C C C C C C C C C H H H H H H H H H H H
charge: -0.319024 -0.445690 -0.434451 -0.190904 -0.181582 -0.413296 -0.140843 -0.081769 -0.509810 -0.094674 0.295142 -0.332258 0.085503 -0.432543 0.163324 0.230516 0.266482 0.292778 0.234670 0.251285 0.197770 0.214021 0.342784 0.294092 0.353659 0.354818
chargesum: 0.00000
title: Mulliken charges with hydrogens summed into heavy atoms:
elementType: O O O O O N C C C C C C C C C
charge: -0.319024 -0.102906 -0.079633 -0.190904 -0.181582 -0.059637 0.089673 0.184713 0.017639 0.156611 0.295142 0.079532 0.085503 -0.138451 0.163324
polarizability: 1.47854468e+02 1.69751693e+01 1.33960172e+02 2.37900106e+00 -1.34843686e+00 7.35273155e+01
1716.lowfreq: -5.4097 -0.0010 -0.0010 -0.0003 4.9149 10.2012 28.4327 41.1360 81.1618
frequency: 28.2188 40.9168 81.1516 93.8480 110.4200 147.1737 167.4451 170.7210 235.0395 267.0762 278.2145 319.6317 335.8732 390.9612 411.0511 457.2208 469.7736 506.9285 550.4206 587.8758 614.1826 632.5163 661.0896 695.7440 724.2103 754.3637 804.3215 816.8492 864.9307 884.9720 907.6519 914.5356 944.2931 966.6268 993.4835 1012.0752 1036.4894 1056.5250 1079.6312 1088.8267 1150.7493 1157.0735 1173.7562 1183.6769 1211.4219 1232.5467 1260.0737 1271.5951 1281.8965 1296.1947 1300.9526 1307.1047 1327.9272 1355.2885 1360.3880 1384.9413 1449.6066 1462.0502 1638.9380 1649.7847 1678.3896 2952.2951 2970.8413 2985.5488 3010.1362 3036.8089 3066.0752 3124.0841 3235.9839 3537.1547 3564.8119 3587.7455
redmass: 7.9146 7.2725 4.1810 6.3077 3.1209 5.4176 7.4308 6.2927 5.3929 2.2381 1.6367 3.8629 4.0917 7.4385 4.6226 1.4323 2.0039 3.0713 3.8629 4.6175 1.1103 8.1922 5.3562 4.7954 4.3275 7.2222 3.6368 3.9959 2.1377 2.0125 3.3258 3.1971 2.2620 3.0019 2.8874 3.2139 2.2702 3.2146 3.7826 2.3260 1.2808 1.2608 1.3018 1.5423 2.2409 1.3458 1.2335 1.3252 2.8672 1.7636 1.6363 1.3866 1.3226 1.5370 1.8488 1.2731 1.0945 1.0907 8.7695 8.2790 11.8052 1.0677 1.0821 1.0856 1.0854 1.0645 1.0959 1.1023 1.0993 1.0653 1.0664 1.0806
irintensity: 0.6792 0.3208 3.4793 0.9695 3.0736 3.4399 2.3995 5.1955 1.1758 85.8341 61.6175 17.7427 6.5882 17.7704 5.0017 118.1479 35.1376 3.1559 12.7859 5.9955 111.4730 10.3136 19.7670 6.1647 2.8387 9.8773 13.5313 27.4058 18.2588 49.4524 6.9452 51.4575 21.3029 52.5075 51.5026 90.5611 49.8377 35.8727 23.8384 47.6430 26.9828 21.5858 20.0828 7.1300 29.0768 8.7595 6.9554 2.1304 107.8723 39.1888 7.4514 21.2538 21.5191 13.5249 3.1340 30.0630 15.4260 7.5305 141.4047 410.2484 71.1182 45.5462 21.2509 41.1707 36.9088 19.8200 41.1527 3.3900 0.7537 7.6828 6.3427 86.5319
temp: 298.150 k
press: 1.00000 atm
elementType: 8 8 8 8 8 7 6 6 6 6 6 6 6 6 6 1 1 1 1 1 1 1 1 1 1 1
symmnumber: 1
zpe: 516243.2 jmol-1
zpe.correction: 0.196627 hartree
zpe.thermalcorrener: 0.210804 hartree
zpe.thermalcorrenthalpy: 0.211748 hartree
zpe.thermalcorrgfe: 0.154345 hartree
zpe.sumelectzpe: -779.273612 hartree
zpe.sumelectthermal: -779.259435 hartree
zpe.sumelectthermalent: -779.258490 hartree
zpe.sumelectthermalfe: -779.315893 hartree
dipole: -2.5848 -1.7141 1.1115
dipole: 3.2947
quadrupole: -82.7877 -109.1980 -84.7736
quadrupole: 2.4647 -1.0277 -0.8058
quadrupole: 9.4654 -16.9449 7.4795 2.4647 -1.0277 -0.8058
hfenergy: -779.4702382 hartree
pointgroup: C01 [X(C9H11N1O5)]
dipole: -1.0299187 0.6391425 -0.4592872 debye
dipolederiv: -0.9908412 -0.2457343 -0.0975955 -0.3317694 -0.4874134 -0.0104827 -0.1357824 0.0298175 -0.4400598 -0.3497371 0.278866 0.0348166 0.3324951 -0.7043445 -0.0845906 0.0722173 -0.1092565 -0.5826978 -0.2400861 0.1275391 0.0721973 0.0133149 -0.784803 0.052256 0.0693704 0.0627011 -0.5486321 -0.5355389 -0.0235742 0.012121 0.1596337 -1.0162184 0.0144025 0.0028686 0.0527863 -0.3190349 -0.8598283 0.4452747 0.0058931 0.2653202 -0.7833615 0.0097997 0.0526527 -0.0282046 -0.3336638 -0.9209986 0.1725759 0.0252051 0.0677169 -1.0404215 0.021424 0.0804679 0.0299731 -0.3582067 0.3294596 -0.2384447 -0.0581074 -0.1820525 0.4744357 0.1561221 -0.1773517 0.1504983 0.4225581 0.3349934 0.2058388 0.0038528 0.6367217 0.3054696 0.0708623 -0.0578055 -0.0341355 0.2651264 -0.1085054 0.0573047 0.0011938 -0.1743148 -0.0034674 0.0775329 0.1747039 0.0172619 0.0308708 0.7016744 0.1139851 0.043074 0.069144 -0.0216027 0.0299554 0.161684 0.0841808 0.2322325 0.3919147 -0.3527507 0.0180269 -0.4365698 -0.1175663 0.0287247 -0.0681568 0.0658104 -0.0773193 0.2328065 -0.0491697 -0.0103155 0.0228539 0.4937654 -0.1663267 -0.042836 -0.1119611 0.3642077 1.0222586 -0.1553695 -0.0713916 -0.2776879 1.3092932 -0.023553 -0.1026517 -0.0673443 0.2645505 -0.6082233 0.1709838 -0.0109618 0.2403097 0.0073762 -0.0194559 0.0385128 -0.0457644 -0.1275641 1.314122 -0.3723873 -0.0501198 -0.1166575 1.3496533 -0.0506014 -0.122321 -0.0300738 0.2854699 -0.0870863 0.0381233 -0.1105639 0.0216605 0.0190101 -0.0507765 -0.0857655 -0.0487277 -0.1271583 0.0073111 -0.0150345 0.0129202 -0.1134062 -0.0157544 -0.070704 -0.0235761 -0.0478773 -0.0112703 0.114365 -0.0585097 0.0136799 -0.0303742 -0.0162324 0.0333006 -0.0066699 0.0055545 0.1002022 0.0458386 0.0409531 0.0261337 0.0383308 0.0457715 -0.1091149 0.012347 -0.054121 -0.0491702 -0.1323605 0.0021206 0.0643345 0.0189666 0.0465374 -0.0164257 0.1022739 -0.0207259 -0.0535353 -0.0171834 -0.0236437 0.1551902 -0.0163902 -0.0232886 0.0648399 0.101428 0.0647022 -0.1281794 -0.1317624 0.0184125 -0.0908724 -0.0127309 0.0359242 0.0169119 -0.0594054 0.0154953 0.0594397 0.0644617 -0.0984097 0.0697034 -0.1800437 0.3231207 0.00016 0.0548728 -0.0262032 0.3050353 0.0875516 -0.0378391 0.024539 -0.0678456 0.0525929 0.0114585 0.0190599 0.0121137 0.1699612 0.2345985 0.0261333 0.0176946 0.0399218 0.1656875 0.0117401 0.0181779 0.012915 0.3612971 0.100796 -0.027244 -0.1006484 0.0134528 0.3858365 0.002541 -0.0783154 0.0205854 0.2955404 unknown
polarizability: 149.1626796|-16.3692687|132.7423095|-0.5278802|-1.471255|73.4369668 unknown
InChI: InChI=1S/C9H11NO5/c11-3-7-5(12)2-6(15-7)4-1-8(13)10-9(4)14/h1,5-7,10-12H,2-3H2
charge 0 multiplicity 1
26 atoms
O  -1.275849 -0.647478 0.718732
O  -3.026419 2.055272 0.409756
O  -2.818176 -2.862023 -0.08637
O  1.91034 2.454921 -0.047205
O  3.919742 -1.798133 -0.005747
N  3.25568 0.488489 -0.083348
C  -2.623012 0.976953 -0.506552
C  -0.459391 0.556837 0.437888
C  -1.130521 1.212307 -0.798325
C  -2.652591 -0.414983 0.177905
C  0.969706 0.163461 0.256051
C  -2.962662 -1.580057 -0.7739
C  2.048401 1.209324 0.031011
C  1.556208 -1.067711 0.271973
C  3.034337 -0.913182 0.052692
H  -3.242513 0.996107 -1.426346
H  -0.547748 1.26045 1.292285
H  -0.898841 2.284706 -0.877469
H  -0.828242 0.696819 -1.726393
H  -3.348216 -0.437626 1.03924
H  -2.29865 -1.527921 -1.66416
H  -4.014483 -1.541754 -1.107664
H  -3.954177 1.902413 0.721157
H  1.081397 -2.034509 0.426515
H  4.169515 0.913824 -0.241451
H  -1.938035 -2.850106 0.373124
