program: Gaussian 09
title: 000125151
version: EM64L-G09RevD.01
frameworkgroup: C1[X(C14H21NO4)]
method: RPBEPBE
basis: SDD
operation: Freq
keyword: #p
keyword: freq=noraman
keyword: PBEPBE/SDD
title: #p freq=noraman PBEPBE/SDD
converged: YES YES NO NO
title: Mulliken charges:
elementType: O O O O N C C C C C C C C C C C C C C H H H H H H H H H H H H H H H H H H H H H
charge: -0.448431 -0.298811 -0.267167 -0.459730 -0.363536 -0.163518 -0.107080 -0.575474 -0.492110 0.212984 0.182583 0.123584 0.169937 -0.356044 -0.386677 -0.373849 -0.327095 -0.518396 -0.534103 0.210659 0.205827 0.253724 0.232502 0.255547 0.240050 0.265554 0.220553 0.210340 0.328929 0.241442 0.238510 0.181531 0.208553 0.228659 0.217663 0.218256 0.217553 0.218802 0.241515 0.346763
chargesum: 0.00000
title: Mulliken charges with hydrogens summed into heavy atoms:
elementType: O O O O N C C C C C C C C C C C C C C
charge: -0.119502 -0.298811 -0.267167 -0.112967 -0.097982 0.047141 0.098747 -0.089248 0.003487 0.212984 0.182583 0.123584 0.169937 0.074849 -0.145235 -0.135339 0.062989 0.146183 0.143767
polarizability: 1.86252215e+02 4.55291433e+00 1.91791364e+02 1.94606999e+01 1.32599571e+00 1.38680670e+02
1716.lowfreq: -12.1717 -8.0445 -4.1802 0.0004 0.0006 0.0006 22.9448 31.3699 45.3891
frequency: 22.8564 31.3606 45.2969 48.7309 66.7991 73.2750 83.7979 128.0960 129.1972 159.2935 162.3199 176.1944 197.1577 224.7717 241.4763 260.9124 265.1371 279.0693 288.3597 308.5970 318.5782 347.5158 379.9463 402.6421 423.9973 455.6297 475.1723 498.4870 524.1440 546.6626 581.2431 605.8145 611.3113 654.1004 679.9846 736.3902 775.9367 800.3804 821.6985 827.1149 853.5805 887.8121 902.8932 920.8610 945.0472 976.5753 983.9854 1007.4844 1016.3681 1031.1816 1049.3752 1059.5935 1097.8187 1111.4180 1112.2765 1123.3216 1140.2739 1149.4084 1150.7915 1167.9437 1173.9840 1179.6132 1189.9112 1199.6102 1214.2411 1218.8125 1238.1829 1250.7615 1270.9701 1283.0399 1308.9330 1325.8265 1334.4759 1349.6823 1364.4501 1383.7530 1398.2663 1415.9212 1420.3103 1427.5886 1435.4464 1440.2769 1456.8811 1458.8225 1463.7266 1465.0746 1467.4597 1474.1088 1477.5448 1479.9142 1491.6342 1592.2442 1606.2625 2843.6329 2896.8757 2935.1086 2949.9393 2954.7920 2959.2323 2981.8196 3002.5986 3005.5220 3034.7103 3037.6912 3041.1359 3042.3610 3052.4732 3106.3542 3119.5680 3145.3672 3168.5830 3466.7480 3542.2157 3577.2849
redmass: 4.6620 4.7898 2.1819 2.3025 3.8293 3.7124 3.6659 3.6298 3.8842 4.0729 1.3132 2.6090 2.7870 2.7643 1.7086 1.1719 2.0358 2.6726 1.5841 1.8937 2.6732 3.9621 4.2353 4.5080 2.9318 4.5638 4.0311 4.1137 3.9441 4.1252 3.7785 2.9637 1.8196 4.5070 5.8686 3.9841 5.0152 1.5189 1.2700 2.6921 2.7144 3.0396 3.7856 1.4159 4.3275 4.8617 2.8592 3.9866 2.8843 2.6955 3.4676 2.3370 1.9824 1.2506 1.2616 1.5369 1.3745 2.2326 1.4070 1.2930 1.3037 1.2522 1.8202 1.5217 1.2554 1.9637 1.3148 3.6241 1.2373 1.3323 1.2618 1.4972 1.7374 1.7650 1.5295 3.5341 1.6173 1.4811 1.4263 1.2631 1.1686 1.1901 1.3877 1.3098 1.7513 1.0681 1.2563 1.1020 1.0774 1.2801 1.0832 7.6693 7.6912 1.0819 1.0704 1.0601 1.0316 1.0332 1.0839 1.0616 1.0979 1.0628 1.1036 1.0985 1.1037 1.0937 1.0981 1.1004 1.0991 1.0876 1.0960 1.0751 1.0656 1.0666
irintensity: 0.2100 0.4315 4.5700 7.0041 2.6663 7.2243 1.9553 3.0800 2.4718 4.7985 0.9590 1.9593 2.7747 9.3585 2.8751 150.1129 8.0690 9.1098 85.5043 22.7216 35.4632 18.9740 9.6673 2.2870 8.0085 6.7306 9.5593 11.9395 7.2649 9.3928 20.8938 18.5587 51.7627 4.0864 16.9358 1.4004 4.3622 34.8785 8.5227 15.3423 4.4846 4.7187 10.6680 1.4344 18.5147 51.7457 52.7953 137.2387 29.6293 10.6029 63.5439 43.8811 35.2935 0.1960 0.1799 9.9540 1.8375 37.0834 5.5317 4.8738 17.1896 13.2328 5.9974 74.9901 24.3731 106.8072 31.1620 31.8006 8.4785 5.6735 3.0476 4.1426 35.9309 1.1493 9.1233 4.8793 21.5690 0.6396 2.7550 27.7520 7.9419 22.0690 6.4014 16.8952 159.2150 20.2098 11.9877 6.4938 0.8684 2.1361 5.4067 11.1098 10.9971 96.8701 102.1050 62.4785 74.6781 78.5266 64.1910 26.8745 44.1610 20.5861 52.1795 8.4757 49.3912 54.5370 7.3933 37.6004 24.9119 8.3468 14.6523 0.3650 3.9002 3.6845
temp: 298.150 k
press: 1.00000 atm
elementType: 8 8 8 8 7 6 6 6 6 6 6 6 6 6 6 6 6 6 6 1 1 1 1 1 1 1 1 1 1 1 1 1 1 1 1 1 1 1 1 1
symmnumber: 1
zpe: 870099.0 jmol-1
zpe.correction: 0.331403 hartree
zpe.thermalcorrener: 0.352013 hartree
zpe.thermalcorrenthalpy: 0.352958 hartree
zpe.thermalcorrgfe: 0.280685 hartree
zpe.sumelectzpe: -900.200210 hartree
zpe.sumelectthermal: -900.179600 hartree
zpe.sumelectthermalent: -900.178655 hartree
zpe.sumelectthermalfe: -900.250928 hartree
dipole: -0.7825 -0.2961 -1.0595
dipole: 1.3501
quadrupole: -106.0667 -100.4434 -111.3582
quadrupole: 1.5646 -0.6743 11.8138
quadrupole: -0.1106 5.5127 -5.4021 1.5646 -0.6743 11.8138
hfenergy: -900.5316128 hartree
pointgroup: C01 [X(C14H21N1O4)]
dipole: 0.2718534 0.1826284 -0.418177 debye
polarizability: 184.1142305|3.3052635|193.5137215|-19.4136777|-4.4460116|139.0962979 unknown
InChI: InChI=1S/C14H21NO4/c1-18-13-3-4-14(19-2)10-8-12(17)11(7-9(10)13)15-5-6-16/h3-4,11-12,15-17H,5-8H2,1-2H3
charge 0 multiplicity 1
40 atoms
O  -0.795989 -0.180434 3.09214
O  2.104852 -2.35139 -1.119332
O  1.132132 3.07528 0.055942
O  -5.81436 -0.561603 -1.381642
N  -2.257802 -0.870022 -0.326022
C  -1.523162 -1.152972 0.925774
C  -1.438341 0.132882 1.792789
C  -0.097778 -1.665782 0.640028
C  -0.609707 1.240341 1.130419
C  0.804925 -0.603448 0.036124
C  0.574042 0.766416 0.305071
C  1.90038 -0.976517 -0.791016
C  1.449559 1.737277 -0.261434
C  -3.726556 -0.997388 -0.269062
C  2.754818 -0.009783 -1.34834
C  2.535826 1.360571 -1.083276
C  -4.362434 -0.346826 -1.502578
C  2.962134 -3.070996 -0.161866
C  2.008306 4.11926 -0.473667
H  -2.048855 -1.939146 1.527326
H  -2.462973 0.519446 1.979672
H  -0.124221 -2.552554 -0.020797
H  0.331411 -1.995856 1.607153
H  -0.26831 1.934835 1.919667
H  -1.273599 1.830054 0.471187
H  -1.845877 -1.348166 -1.136024
H  -4.099489 -0.473358 0.62991
H  -4.082863 -2.053008 -0.198148
H  -1.345117 -0.863547 3.556461
H  3.574363 -0.333409 -1.99826
H  3.201545 2.108502 -1.522815
H  -3.968136 -0.821171 -2.429052
H  -4.105098 0.731776 -1.523903
H  3.052719 -4.098464 -0.548359
H  2.510339 -3.089818 0.850111
H  3.964434 -2.602728 -0.100131
H  2.00377 4.128143 -1.581558
H  3.047759 3.997103 -0.110417
H  1.592497 5.064796 -0.094728
H  -6.276442 -0.127897 -2.141547
