program: Gaussian 09
title: 000125139
version: EM64L-G09RevD.01
frameworkgroup: C1[X(C18H26N4O7S)]
method: RPBEPBE
basis: SDD
operation: Freq
keyword: #p
keyword: freq=noraman
keyword: PBEPBE/SDD
title: #p freq=noraman PBEPBE/SDD
converged: YES YES NO NO
title: Mulliken charges:
elementType: S O O O O O O O N N N N C C C C C C C C C C C C C C C C C C H H H H H H H H H H H H H H H H H H H H H H H H H H
charge: 0.149568 -0.488328 -0.267087 -0.293693 -0.409969 -0.283828 -0.451148 -0.211622 -0.186257 -0.372091 -0.379825 -0.558342 -0.579903 -0.440592 0.392021 -0.372660 0.265561 -0.256116 -0.389155 -0.664660 -0.505221 -0.190799 0.223340 0.229905 -0.562223 -0.403656 -0.190934 -0.383724 0.211421 0.180836 0.284242 0.251164 0.232603 0.230453 0.242620 0.248960 0.253935 0.292298 0.236473 0.191183 0.185861 0.278327 0.362138 0.229796 0.272462 0.380161 0.278670 0.216947 0.249414 0.356873 0.282596 0.285650 0.280137 0.290689 0.378991 0.396538
chargesum: 0.00000
title: Mulliken charges with hydrogens summed into heavy atoms:
elementType: S O O O O O O O N N N N C C C C C C C C C C C C C C C C C C
charge: 0.149568 -0.108167 -0.267087 -0.293693 -0.030978 -0.283828 -0.054610 -0.211622 -0.186257 -0.009954 -0.022952 0.012484 -0.295661 0.043174 0.392021 0.100413 0.265561 -0.007156 -0.135220 -0.135889 -0.128176 0.087528 0.223340 0.229905 -0.059964 0.091962 0.058480 0.184521 0.211421 0.180836
chargesum: -0.00012
polarizability: 3.12770432e+02 -4.63500352e+00 2.73220372e+02 -1.62941871e+01 -1.12517676e+01 2.22128140e+02
1716.lowfreq: -7.5874 -0.9975 -0.1120 -0.0308 0.8085 3.2804 6.6544 13.7391 20.3726
frequency: 4.1998 13.4853 19.3726 27.6467 33.4946 36.8878 40.6737 43.5219 49.1426 55.7698 64.4438 71.3109 80.1822 99.1598 106.4250 113.1670 121.0896 138.7377 146.3286 162.0171 171.9256 175.2117 205.9839 206.3236 218.4362 228.9678 249.8792 268.6909 273.1551 280.7132 291.1266 303.0113 322.3492 329.7468 387.4986 397.9673 444.6778 482.5484 483.8694 495.3377 502.7282 542.3056 544.3306 550.6754 555.0346 570.8286 580.5299 584.1018 593.8811 597.9512 618.2282 623.4616 629.2219 643.1526 647.5690 650.4874 655.2878 702.0859 708.2221 708.7912 729.2453 761.3514 767.3558 783.6984 795.1086 815.2048 831.6608 843.2254 870.7646 881.6621 909.6409 911.8533 936.5549 942.7523 965.0510 979.5305 983.7751 1000.3433 1005.9564 1016.6455 1030.5305 1047.7842 1050.0160 1051.2463 1059.9892 1078.2488 1096.7676 1113.6418 1123.8490 1138.6153 1149.4638 1154.1989 1165.7087 1179.0058 1195.5769 1207.2456 1210.3930 1214.0304 1217.3287 1223.6135 1227.5263 1239.4333 1250.9501 1252.5928 1264.0807 1286.3623 1289.7868 1294.7306 1304.2257 1308.0373 1318.2343 1327.8089 1338.6098 1347.5058 1353.3370 1356.5511 1375.6591 1397.3968 1409.4779 1431.7455 1443.6299 1450.7659 1452.5736 1459.4140 1459.7455 1468.4172 1475.2929 1480.8619 1492.5412 1495.7756 1592.4915 1593.9605 1618.5269 1629.8356 1632.6697 1687.6572 2927.5953 2964.0677 2969.6079 2973.9612 2992.9564 2994.5387 3002.1385 3005.3094 3007.3220 3027.2693 3032.3769 3040.1465 3058.4240 3064.6411 3081.6376 3085.4644 3102.3960 3206.1327 3236.2672 3426.8546 3467.8883 3494.4042 3497.4725 3534.1596 3546.4414 3604.3752
redmass: 7.6251 6.4277 6.7416 7.2955 5.9036 6.4944 4.5034 5.0514 8.0915 7.4937 6.7670 8.7302 5.3266 4.4251 5.4729 6.0273 3.9829 4.5626 3.6745 4.1593 2.9721 3.2310 3.0345 3.4764 4.7223 4.5534 3.4565 6.0079 4.7718 3.8752 4.9968 1.4646 2.8630 2.8605 4.9180 4.4329 4.5659 3.3965 2.7740 2.5288 3.1463 4.0179 2.2390 1.7187 3.7996 2.2529 1.2514 1.6709 3.3151 2.7849 3.8170 3.2223 1.4239 1.6591 2.3148 1.5402 4.0244 3.2689 3.7578 1.9512 1.9235 4.1139 4.5295 3.5350 3.2082 3.8606 1.7812 1.3986 2.4729 2.4212 4.4859 2.0436 5.5927 4.7733 1.9729 2.0275 2.0467 2.4481 2.8371 2.3297 2.0314 1.6556 2.1988 1.4567 4.0722 2.1271 3.4695 2.6075 1.7104 1.3369 2.0303 1.2963 1.5025 1.3528 1.2151 1.3176 1.4341 1.1214 1.6214 1.3857 1.3402 1.7746 1.5701 1.5624 1.2411 1.6165 1.4438 1.2246 2.1498 1.4453 1.3219 1.3185 1.6191 2.7888 1.5670 1.4703 1.7026 4.9161 1.4234 4.7600 1.0871 1.1510 1.2727 1.1118 1.7710 1.0915 1.1394 2.1893 1.2389 2.1775 8.2051 7.4755 6.5806 1.2577 4.0496 9.2621 1.0554 1.0607 1.0808 1.1058 1.0607 1.0621 1.0650 1.0656 1.0607 1.0983 1.0990 1.0844 1.0898 1.1005 1.0991 1.1043 1.0999 1.0915 1.1049 1.0673 1.0442 1.0780 1.0639 1.0645 1.0783 1.0998
irintensity: 0.3111 1.5365 2.0717 2.0270 1.5138 6.2290 2.2811 0.7091 0.6045 0.9422 0.2651 2.5487 5.6357 7.1154 1.2058 14.9666 5.3238 1.7022 7.7508 6.5724 1.2985 14.1165 4.4745 3.5178 2.5843 0.6923 4.4893 10.6942 4.3547 1.0362 4.7892 36.6878 13.2670 8.0716 3.9084 19.3361 44.1521 6.2795 50.0168 18.0191 37.4301 38.0281 117.4866 169.3130 35.1181 44.3335 52.4760 101.9775 28.5822 25.4775 18.4690 55.7656 127.9665 34.0903 95.2120 208.7683 4.5278 1.2587 53.1150 18.9592 24.2338 31.3148 4.2618 2.6806 6.2143 8.1328 15.8548 5.4147 12.1860 55.9171 18.3871 3.5404 65.6557 23.5024 5.1014 0.9009 32.5315 10.6058 1.4251 3.8948 30.4243 27.6529 236.2414 25.5163 25.1328 218.0487 23.0058 9.6814 3.5671 1.7876 2.2767 18.0975 22.5731 4.5458 45.9061 5.5802 13.6068 1.0486 2.4251 6.2947 28.9836 26.8718 5.5659 17.7580 6.3346 31.1479 7.7347 21.3692 47.9349 11.7209 17.7705 4.1945 22.7470 25.5882 14.4076 8.5346 7.5114 5.5340 9.3459 17.4649 18.6709 22.6478 14.0751 9.4572 5.9153 16.4632 28.7057 799.8810 13.8630 52.0691 47.7069 164.1397 64.4818 79.9553 280.2224 277.6527 56.4483 18.8782 18.1626 57.4561 24.6577 62.7735 16.6152 16.4807 59.6106 0.4651 4.0587 18.8833 15.4392 32.9683 13.7824 13.7859 22.1955 2.6137 4.3892 373.6792 5.4036 84.0795 24.3794 33.4247 67.8208 5.3878
temp: 298.150 k
press: 1.00000 atm
elementType: 16 8 8 8 8 8 8 8 7 7 7 7 6 6 6 6 6 6 6 6 6 6 6 6 6 6 6 6 6 6 1 1 1 1 1 1 1 1 1 1 1 1 1 1 1 1 1 1 1 1 1 1 1 1 1 1
symmnumber: 1
zpe: 1157052.3 jmol-1
zpe.correction: 0.440698 hartree
zpe.thermalcorrener: 0.472929 hartree
zpe.thermalcorrenthalpy: 0.473873 hartree
zpe.thermalcorrgfe: 0.369849 hartree
zpe.sumelectzpe: -1842.879937 hartree
zpe.sumelectthermal: -1842.847707 hartree
zpe.sumelectthermalent: -1842.846763 hartree
zpe.sumelectthermalfe: -1842.950786 hartree
dipole: 0.0375 1.0071 3.3354
dipole: 3.4844
quadrupole: -143.5970 -168.6938 -194.1637
quadrupole: -12.8791 -25.7080 8.3404
quadrupole: 25.2212 0.1244 -25.3456 -12.8791 -25.7080 8.3404
hfenergy: -1843.3206354 hartree
pointgroup: C01 [X(C18H26N4O7S1)]
dipole: -0.1078353 -0.241253 -1.3451426 debye
polarizability: 301.630894|-16.6181376|284.9977492|12.347724|-16.1659103|221.4903004 unknown
InChI: InChI=1S/C18H26N4O7S/c19-11(18(28)29)1-2-14(24)21-12(17(27)20-7-15(25)26)9-30-13-4-6-22-5-3-10(8-23)16(13)22/h3,5,11-13,20-21,23,25,28H,1-2,4,6-9,19H2
charge 0 multiplicity 1
56 atoms
S  -2.239722 0.061076 -0.322818
O  1.421461 -2.200429 1.395852
O  -0.902407 2.841903 1.800801
O  1.818636 1.433415 -1.976471
O  6.172989 -1.015883 2.026001
O  4.244421 -2.157824 1.458564
O  -4.106015 5.377984 -0.811514
O  -4.879668 6.170207 1.235693
N  -2.64661 -3.508287 -0.241024
N  0.654666 1.57033 0.021333
N  -2.225043 3.856468 0.193915
N  6.102364 -1.250086 -1.068844
C  -1.960199 -1.559062 -1.382427
C  -3.314052 -2.068785 -1.975047
C  -1.538214 -2.699126 -0.516845
C  -3.883522 -3.040304 -0.894308
C  -0.423082 -3.235099 0.150159
C  -2.276438 -4.548322 0.599969
C  -0.898921 -4.403274 0.851222
C  -1.407551 1.369941 -1.404746
C  0.985498 -2.719513 0.082947
C  -0.469045 2.288662 -0.569095
C  -1.209891 3.012509 0.58092
C  1.758064 1.215715 -0.720923
C  2.90508 0.594778 0.088595
C  3.862396 -0.222481 -0.801883
C  5.228048 -0.49596 -0.147727
C  -3.025556 4.558178 1.19772
C  5.104435 -1.288627 1.165708
C  -4.092451 5.45087 0.592537
H  -1.229135 -1.261011 -2.150641
H  -4.0052 -1.244323 -2.208272
H  -3.106317 -2.635608 -2.902574
H  -4.451961 -3.87889 -1.332273
H  -4.531703 -2.509844 -0.170719
H  -2.983598 -5.300031 0.943977
H  -0.296119 -5.059348 1.477969
H  -0.789464 0.861202 -2.163646
H  -2.180876 1.967384 -1.920428
H  1.67059 -3.535583 -0.233742
H  1.042513 -1.912573 -0.679744
H  -0.063798 3.041519 -1.278267
H  0.588085 1.375507 1.026736
H  3.4585 1.431533 0.564756
H  2.481217 -0.028351 0.899643
H  2.409559 -2.318563 1.470521
H  4.043869 0.32573 -1.742297
H  3.384132 -1.182949 -1.075773
H  5.724619 0.461593 0.089524
H  -2.47577 3.987793 -0.788226
H  -2.38284 5.180852 1.849616
H  -3.523396 3.840316 1.879325
H  5.697153 -2.121484 -1.423412
H  7.078466 -1.339221 -0.773767
H  6.113572 -1.597273 2.833322
H  -4.817167 5.970146 -1.175375
