program: Gaussian 09
title: 000125135
version: EM64L-G09RevD.01
frameworkgroup: C1[X(C18H21N3O8S)]
method: RPBEPBE
basis: SDD
operation: Freq
keyword: #p
keyword: freq=noraman
keyword: PBEPBE/SDD
title: #p freq=noraman PBEPBE/SDD
converged: YES YES NO NO
title: Mulliken charges:
elementType: S O O O O O O O O N N N C C C C C C C C C C C C C C C C C C H H H H H H H H H H H H H H H H H H H H H
charge: 0.107171 -0.414073 -0.415543 -0.222675 -0.229670 -0.413295 -0.412197 -0.225781 -0.224536 -0.138099 -0.114751 0.317515 -0.080912 -0.384716 -0.618399 -0.444838 -0.438368 0.559396 -0.435179 -0.431610 -0.450910 -0.352807 0.172000 0.214783 0.191900 0.183624 -0.384907 -0.397729 0.482747 -0.799163 0.270746 0.232296 0.193327 0.276211 0.202992 0.244391 0.272517 0.226800 0.274060 0.232012 0.289458 0.235997 0.277940 0.246103 0.285211 0.249108 0.251757 0.385649 0.383552 0.384354 0.386543
chargesum: 0.00000
title: Mulliken charges with hydrogens summed into heavy atoms:
elementType: S O O O O O O O O N N N C C C C C C C C C C C C C C C C C C
charge: 0.107171 -0.028424 -0.031991 -0.222675 -0.229670 -0.028941 -0.025654 -0.225781 -0.224536 -0.138099 -0.114751 0.317515 0.189834 0.040906 -0.139196 0.072070 0.062492 0.559396 0.086290 0.082328 -0.204807 -0.067596 0.172000 0.214783 0.191900 0.183624 -0.135798 -0.145972 0.482747 -0.799163
polarizability: 3.88755386e+02 3.15324256e+01 2.48999595e+02 -2.32806939e+01 -2.65307845e+00 1.94806258e+02
1716.lowfreq: -5.0484 -3.2980 -0.0018 -0.0017 -0.0009 4.6914 7.3757 13.6095 16.4231
frequency: 6.2893 13.5127 16.3932 23.9550 24.4076 27.4368 33.7931 37.3531 39.1847 41.0909 44.7612 47.1304 53.3764 57.1782 60.0987 84.6929 121.3211 128.2607 162.1866 180.6288 190.7685 200.8021 211.3998 219.0715 263.6929 281.1819 295.9189 312.9036 327.3818 329.9414 340.8201 370.1170 377.6527 399.7483 407.9126 424.8197 427.6986 445.3223 461.6338 475.9827 481.9489 484.6492 492.9779 507.1827 516.4092 529.9549 551.5532 588.2704 612.6923 621.2610 627.2607 631.9498 635.2249 636.4074 638.4426 648.1049 658.3058 729.9718 780.7535 800.4495 825.1784 837.5985 844.9444 852.1652 858.0054 864.7069 882.9250 900.2433 902.1283 947.3806 962.1587 967.6597 970.2664 977.6710 982.7187 984.1327 1008.5356 1023.5839 1037.1385 1042.8597 1048.5763 1057.6866 1087.4601 1113.3215 1145.7684 1149.7108 1164.6880 1169.0965 1185.6862 1216.2021 1220.8864 1243.8326 1246.9736 1249.7845 1254.5265 1260.6024 1263.9977 1266.8475 1283.1467 1287.1352 1288.1771 1304.4105 1317.1671 1342.3832 1363.1653 1367.7742 1373.3563 1381.6620 1389.7729 1393.2509 1396.5658 1417.3445 1434.5766 1438.0160 1445.3890 1449.1146 1461.7357 1468.8051 1496.4485 1565.5336 1614.0553 1672.9153 1674.3682 1675.7652 1677.8581 2196.8093 2838.9316 2851.5200 2858.6936 2871.5839 2891.8179 2983.7765 3043.4521 3046.0169 3051.8165 3055.8116 3060.7110 3064.3970 3067.0258 3128.8230 3145.9950 3160.4742 3166.2723 3513.3307 3517.8876 3519.8178 3520.7294
redmass: 7.8818 9.8946 8.1418 8.4287 9.4341 8.3644 6.6446 9.7349 8.1909 10.6918 9.6743 7.7596 5.7632 5.8903 4.8442 5.8849 6.4756 5.3648 3.5067 4.3316 3.8407 5.9468 4.5560 3.6130 4.7115 3.4640 4.5638 3.5454 4.1445 4.2635 3.2011 5.9795 6.1534 4.7062 2.9372 4.2502 4.4698 6.4776 3.8681 2.5307 2.0124 2.2115 2.2440 2.6251 3.5136 3.3493 3.0223 4.1561 3.7106 1.9928 1.8930 1.5120 2.3180 2.4592 2.7301 2.9703 2.9108 3.8163 3.5757 3.1492 4.2247 1.3531 3.1777 1.9897 3.0755 3.8082 2.3263 4.0113 8.1160 2.4153 1.4609 2.1939 2.4361 2.2590 2.3001 1.3659 2.7583 3.2159 2.6448 2.4839 2.3848 3.0148 2.5527 1.4362 1.9505 2.4497 2.0171 1.6929 1.1299 2.3369 1.3446 1.3608 1.3584 1.3157 1.5059 1.9414 2.8696 1.3866 1.8030 1.8107 1.8233 1.3425 1.4087 1.6987 1.4298 1.6010 2.5662 1.5830 1.4890 1.4727 1.5013 3.0160 1.1017 1.1048 1.1136 1.1123 1.0982 1.1161 2.6646 6.6113 6.2987 8.4700 8.5294 8.3615 8.3379 12.8765 1.0706 1.0713 1.0712 1.0702 1.0712 1.0660 1.0853 1.0847 1.0848 1.0850 1.0875 1.0855 1.0923 1.0891 1.0887 1.0959 1.0976 1.0641 1.0642 1.0642 1.0642
irintensity: 0.0804 0.0246 0.2787 0.1896 1.0735 0.6505 0.3292 0.1391 0.9344 0.7617 0.9827 0.2600 0.7900 0.5900 1.2508 0.1180 1.2948 0.6244 0.8189 3.9932 4.2108 1.5428 1.2302 4.4225 0.2494 1.4565 4.2432 4.0290 2.9957 6.2259 3.9329 24.1894 2.2255 5.5981 0.0230 4.0111 10.9738 1.9557 1.1290 11.1487 16.1063 11.7754 37.5605 28.3015 78.3961 41.9277 3.3439 46.8951 54.6929 52.8664 47.2262 99.2013 75.1289 84.4437 100.7136 37.1811 51.0091 7.8741 12.8068 18.6251 19.0921 6.4130 1.6294 54.1490 0.3327 0.4487 5.6466 15.8405 39.6524 22.9914 13.3040 66.2291 87.0814 30.2641 16.8790 0.7062 1.1097 214.3057 680.6689 406.1285 109.4648 19.6065 21.0145 10.1379 25.5446 65.5864 11.9297 9.0285 0.5670 1.6061 5.4248 14.6063 18.9300 12.9459 28.8638 14.1172 2.9074 8.2740 3.0686 13.1552 7.1609 3.2383 9.6817 1.8071 12.1720 8.9422 7.6416 18.2711 20.7289 3.6385 17.9935 3.1778 27.5807 11.6724 36.0028 8.1313 17.0660 29.2612 82.2918 3.5046 2.9332 290.6166 245.1711 225.5943 139.6369 1357.8335 58.0977 66.1864 88.6318 134.4016 86.4670 31.8312 5.1670 3.8678 5.7608 4.3141 11.2275 3.1666 21.8590 13.1977 2.8267 8.4130 3.9483 31.1784 36.4650 35.0696 37.1263
temp: 298.150 k
press: 1.00000 atm
elementType: 16 8 8 8 8 8 8 8 8 7 7 7 6 6 6 6 6 6 6 6 6 6 6 6 6 6 6 6 6 6 1 1 1 1 1 1 1 1 1 1 1 1 1 1 1 1 1 1 1 1 1
symmnumber: 1
zpe: 997056.5 jmol-1
zpe.correction: 0.379759 hartree
zpe.thermalcorrener: 0.411398 hartree
zpe.thermalcorrenthalpy: 0.412342 hartree
zpe.thermalcorrgfe: 0.306721 hartree
zpe.sumelectzpe: -1860.372384 hartree
zpe.sumelectthermal: -1860.340745 hartree
zpe.sumelectthermalent: -1860.339800 hartree
zpe.sumelectthermalfe: -1860.445422 hartree
dipole: 9.2020 2.8590 1.9971
dipole: 9.8407
quadrupole: -211.3762 -166.8772 -168.6662
quadrupole: -7.4342 -2.5278 -8.2141
quadrupole: -29.0697 15.4293 13.6404 -7.4342 -2.5278 -8.2141
hfenergy: -1860.7521426 hartree
pointgroup: C01 [X(C18H21N3O8S1)]
dipole: -3.2830097 -1.7099321 1.1346808 debye
polarizability: 368.0921477|61.9529143|269.692396|10.6541286|-7.0903665|194.776695 unknown
InChI: InChI=1S/C18H21N3O8S/c22-15(23)7-20(8-16(24)25)6-14(21(9-17(26)27)10-18(28)29)5-12-1-3-13(4-2-12)19-11-30/h1-4,14,22,24,26,28H,5-10H2
charge 0 multiplicity 1
51 atoms
S  7.397909 3.534588 -1.013682
O  0.370288 -5.235149 -0.755751
O  1.131106 -1.685713 4.214874
O  1.90331 -3.838743 0.294956
O  0.966956 0.06257 2.69922
O  -5.691216 -0.006571 -2.453667
O  -3.053775 3.617388 2.175924
O  -3.402685 -0.365542 -2.617731
O  -3.468463 3.39569 -0.100203
N  -0.19851 -1.914911 0.781966
N  -3.093102 0.520679 0.137833
N  4.83456 2.312441 -1.034166
C  -0.858198 -0.659168 0.319889
C  -2.416792 -0.785021 0.328702
C  -0.347535 -0.191588 -1.072633
C  -0.476636 -3.128181 0.015476
C  -0.100245 -2.154099 2.226261
C  1.029447 0.453557 -1.051865
C  -4.419636 0.460364 -0.489025
C  -3.048682 1.385982 1.322038
C  1.177165 1.819188 -1.409833
C  2.194094 -0.274888 -0.686228
C  0.740594 -4.050476 -0.103634
C  0.714341 -1.121696 3.001108
C  -4.387093 -0.01155 -1.938022
C  -3.21398 2.869655 1.00202
C  2.43735 2.449171 -1.407249
C  3.461154 0.336982 -0.677208
C  3.590576 1.705811 -1.03954
C  5.923288 2.829677 -1.02498
H  -0.552863 0.113486 1.04568
H  -2.721722 -1.442854 -0.503214
H  -2.738566 -1.279681 1.28109
H  -1.095771 0.523677 -1.455739
H  -0.358072 -1.044055 -1.781084
H  -1.314749 -3.749945 0.411899
H  -0.769714 -2.861368 -1.015679
H  -1.092165 -2.217773 2.745228
H  0.395557 -3.124593 2.396755
H  -5.150074 -0.190648 0.053922
H  -4.854885 1.475213 -0.51103
H  -3.815338 1.132148 2.098069
H  -2.071261 1.278827 1.82385
H  0.29076 2.397129 -1.697064
H  2.101976 -1.322367 -0.381773
H  2.542318 3.502309 -1.686632
H  4.353311 -0.22923 -0.391201
H  1.167163 -5.823333 -0.856576
H  1.627974 -1.00302 4.742942
H  -5.670718 -0.294086 -3.406446
H  -3.15635 4.586218 1.971452
