program: Gaussian 09
title: 000125131
version: EM64L-G09RevD.01
frameworkgroup: C1[X(C17H12BrI4NO5)]
method: RPBEPBE
basis: SDD
operation: Freq
keyword: #p
keyword: freq=noraman
keyword: PBEPBE/SDD
title: #p freq=noraman PBEPBE/SDD
converged: YES YES NO NO
title: Mulliken charges:
elementType: I I I I Br O O O O O N C C C C C C C C C C C C C C C C C H H H H H H H H H H H H
charge: 0.150416 0.155563 0.126777 0.137570 -0.024466 -0.280229 -0.429826 -0.207591 -0.259929 -0.392200 -0.384530 -0.618658 -0.140136 0.549234 -0.328465 -0.348663 0.162380 0.522566 -0.490410 -0.474239 0.324060 0.344511 -0.762471 -0.241518 -0.333963 -0.474560 -0.506422 0.558877 0.260394 0.230458 0.312844 0.353876 0.257104 0.264169 0.317558 0.319632 0.325662 0.279124 0.399033 0.346468
chargesum: 0.00000
title: Mulliken charges with hydrogens summed into heavy atoms:
elementType: I I I I Br O O O O O N C C C C C C C C C C C C C C C C C
charge: 0.150416 0.155563 0.126777 0.137570 -0.024466 -0.280229 -0.030793 -0.207591 -0.259929 -0.045732 -0.030655 -0.127806 0.172708 0.549234 -0.071361 -0.084494 0.162380 0.522566 -0.490410 -0.474239 0.324060 0.344511 -0.125281 0.084144 -0.054839 -0.474560 -0.506422 0.558877
polarizability: 4.34676196e+02 -1.06914290e+01 2.86414292e+02 -1.78418452e+01 -2.25365286e+01 2.57793192e+02
1716.lowfreq: -2.9534 -0.6257 -0.0007 -0.0004 -0.0003 3.1210 9.0193 9.9705 13.8119
frequency: 8.9855 9.8787 13.7790 15.1862 22.1015 29.8498 38.1061 39.6708 45.2341 70.0252 70.8871 73.7760 84.8569 97.6649 100.2738 114.7709 119.0834 139.5956 171.8925 179.7862 183.5563 186.5986 200.7395 222.0167 225.1744 239.7843 245.4915 282.3907 323.9775 337.9159 344.5739 352.1238 368.4976 395.5028 406.2527 460.1787 478.5818 484.7858 488.5968 508.3097 517.8602 535.0552 551.2258 569.2920 572.4913 600.5620 610.2081 644.3832 646.9959 670.0258 677.0249 690.3801 691.9300 707.3848 713.1038 757.4871 797.0012 851.3402 856.2662 859.8143 874.1549 876.5650 891.9606 895.2759 912.4753 912.7225 942.9052 999.6804 1019.9813 1031.7875 1079.6172 1101.9255 1131.7557 1149.9166 1162.7373 1191.6739 1201.0021 1202.8267 1223.0035 1234.6221 1239.7452 1242.2455 1258.6310 1287.6448 1299.2591 1307.5837 1337.4681 1353.2924 1365.3846 1383.5249 1392.7412 1410.9165 1423.2550 1449.7136 1469.4573 1498.3055 1543.3481 1554.8485 1580.4106 1590.0446 1596.1641 1672.1886 3008.2014 3032.2947 3065.3109 3075.8284 3143.4777 3148.2156 3151.4285 3156.5943 3187.6361 3458.0003 3489.5745 3528.1933
redmass: 41.4934 29.9891 49.0162 19.3751 17.5361 8.8586 9.9853 14.4602 13.6891 61.0985 10.8089 14.8548 3.9086 19.1899 8.2844 10.5659 8.2186 16.8974 7.9286 5.1750 5.9461 4.6788 6.6745 10.7889 9.1455 9.0146 9.2182 7.4673 12.7020 6.6378 6.3965 6.8909 4.1274 1.1034 3.9481 6.2868 5.8435 5.3283 5.0732 6.8867 5.5857 3.6163 3.5709 3.9389 3.9260 1.7372 3.2298 3.9707 3.9660 2.8803 1.5200 7.3469 5.9854 5.4015 6.4142 8.2781 6.5495 4.7677 2.0768 1.4551 2.2280 2.5621 1.8778 2.4628 2.1828 1.6043 5.1009 2.8589 3.6872 3.7427 2.1179 2.9089 1.6139 1.1331 2.1675 1.5717 1.5192 1.6205 2.5165 1.2591 3.2722 1.4032 1.7336 2.1758 2.0980 1.3880 1.6258 4.9952 3.8091 2.4975 4.7096 1.1008 3.7750 3.6553 1.1316 1.9681 7.9975 7.4319 7.0549 8.6679 7.9345 9.5715 1.0597 1.0837 1.0574 1.1042 1.0941 1.1077 1.0924 1.0929 1.0932 1.0649 1.0778 1.0645
irintensity: 0.1120 0.0730 0.0176 0.1591 0.1194 2.7699 0.0577 0.6909 0.4432 0.0246 0.0982 0.5740 4.7423 1.7246 9.5133 0.4570 0.2838 0.6149 2.5791 1.5924 1.6023 1.2410 4.7444 2.1296 0.5416 0.0975 3.7328 3.1628 1.6711 2.3144 1.8903 6.3067 3.6257 119.5294 9.2683 9.4428 19.1008 0.4078 0.9282 7.6236 5.7659 23.1467 1.6671 20.0736 5.6867 118.8998 33.6563 37.0798 76.7874 1.9426 135.2742 39.6393 37.0294 37.6276 10.7783 44.2317 27.8679 23.2449 14.7540 19.8231 15.0024 19.9972 31.3175 40.8770 10.6113 5.1720 47.9421 4.8408 1.1340 18.1528 227.5798 14.0994 145.3047 2.1482 113.6796 9.1066 19.3391 53.8315 73.3435 50.3900 124.3093 3.0028 6.0046 34.2763 60.9733 29.7200 6.2128 1.3760 151.2990 44.3130 11.7908 29.1798 239.9021 130.6268 40.1398 258.0835 68.7497 53.3517 20.2673 85.2421 156.6347 259.0254 21.4751 3.5196 1.9961 6.9919 24.8657 0.1070 0.8730 5.4354 1.7377 83.7323 93.5995 51.2418
temp: 298.150 k
press: 1.00000 atm
elementType: 53 53 53 53 35 8 8 8 8 8 7 6 6 6 6 6 6 6 6 6 6 6 6 6 6 6 6 6 1 1 1 1 1 1 1 1 1 1 1 1
symmnumber: 1
zpe: 672527.4 jmol-1
zpe.correction: 0.256152 hartree
zpe.thermalcorrener: 0.286154 hartree
zpe.thermalcorrenthalpy: 0.287098 hartree
zpe.thermalcorrgfe: 0.183645 hartree
zpe.sumelectzpe: -1143.346360 hartree
zpe.sumelectthermal: -1143.316358 hartree
zpe.sumelectthermalent: -1143.315413 hartree
zpe.sumelectthermalfe: -1143.418866 hartree
dipole: 3.8568 0.0457 1.6201
dipole: 4.1835
quadrupole: -184.3612 -237.4800 -235.6333
quadrupole: -1.5565 1.6366 -0.0486
quadrupole: 34.7970 -18.3219 -16.4751 -1.5565 1.6366 -0.0486
hfenergy: -1143.6025117 hartree
pointgroup: C01 [X(C17H12Br1I4N1O5)]
dipole: -1.4503942 -0.1133537 0.7697284 debye
polarizability: 435.6915521|-13.736948|277.5447133|-0.8152681|27.4723145|265.6474142 unknown
InChI: InChI=1S/C17H12BrI4NO5/c18-6-14(24)23-13(17(26)27)3-7-1-11(21)16(12(22)2-7)28-8-4-9(19)15(25)10(20)5-8/h1-2,4-5,13,23,25-26H,3,6H2
charge 0 multiplicity 1
40 atoms
I  0.920093 -0.560097 3.40559
I  1.110401 -3.119245 -2.195101
I  7.068955 0.413236 0.080245
I  1.958317 3.332016 -1.703777
Br -3.282726 3.575727 1.976328
O  2.08151 -1.761511 0.601696
O  -6.141407 0.704326 0.107477
O  -6.102285 -1.012767 -1.463528
O  -1.473294 1.0088 -0.840135
O  5.021595 2.730793 -1.147504
N  -3.523004 0.907576 0.276488
C  -3.664014 -1.63282 0.345686
C  -3.991272 -0.29182 -0.423906
C  -2.164471 -1.805143 0.481963
C  -1.413254 -2.337452 -0.59369
C  -1.489957 -1.327489 1.630455
C  -5.49459 -0.25162 -0.686032
C  0.676572 -1.773052 0.56186
C  -0.081358 -1.310416 1.666187
C  -0.006844 -2.323282 -0.552634
C  -2.303865 1.475692 0.00261
C  2.765301 -0.597368 0.142117
C  -1.88669 2.73793 0.757328
C  2.11546 0.521694 -0.425741
C  4.16607 -0.642451 0.28814
C  4.921854 0.461173 -0.140228
C  2.902796 1.614495 -0.842124
C  4.316772 1.614574 -0.712348
H  -4.113782 -2.459144 -0.233961
H  -4.155161 -1.598755 1.335183
H  -3.476482 -0.338035 -1.401592
H  -4.170797 1.38282 0.914102
H  -1.927831 -2.732271 -1.475252
H  -2.063241 -0.945537 2.480376
H  -1.610158 3.519714 0.035227
H  -1.027719 2.51229 1.408228
H  1.027854 0.550886 -0.55157
H  4.628585 -1.527201 0.729823
H  -7.121136 0.689885 -0.064353
H  5.999404 2.603151 -1.009131
