program: Gaussian 09
title: 000125125
version: EM64L-G09RevD.01
frameworkgroup: C1[X(C13H23NO2)]
method: RPBEPBE
basis: SDD
operation: Freq
keyword: #p
keyword: freq=noraman
keyword: PBEPBE/SDD
title: #p freq=noraman PBEPBE/SDD
converged: YES YES NO NO
title: Mulliken charges:
elementType: O O N C C C C C C C C C C C C C H H H H H H H H H H H H H H H H H H H H H H H
charge: -0.214398 -0.211915 -0.167232 -0.354556 -0.374208 -0.381250 -0.383804 -0.394851 -0.370640 -0.353923 -0.507936 -0.509436 0.176368 0.178469 -0.356084 -0.696412 0.192223 0.204800 0.190611 0.192477 0.207034 0.236098 0.195238 0.190873 0.242107 0.239603 0.189142 0.189335 0.187437 0.188724 0.261263 0.263340 0.264116 0.263354 0.194873 0.194645 0.215026 0.209475 0.210013
chargesum: 0.00000
title: Mulliken charges with hydrogens summed into heavy atoms:
elementType: O O N C C C C C C C C C C C C C
charge: -0.214398 -0.211915 -0.167232 0.042467 0.008880 0.061882 0.002306 0.086860 0.007837 0.022239 0.016667 0.018034 0.176368 0.178469 0.033434 -0.061898
polarizability: 1.66888171e+02 1.84025666e-01 1.47097225e+02 -9.07049924e+00 -5.71731765e+00 1.36613440e+02
1716.lowfreq: -5.1539 -0.0005 -0.0001 0.0007 5.1626 14.6182 20.7738 31.1806 43.8143
frequency: 19.8158 31.0474 43.7582 45.3490 64.8751 87.2421 88.6203 94.3231 106.8350 134.1024 141.2472 150.1603 172.1164 211.6964 223.5052 266.0025 292.8182 324.2671 367.7208 430.4220 453.4334 503.0624 540.9128 545.0783 566.9822 604.5797 654.3789 674.7872 719.9466 725.2864 744.7202 788.2076 822.3700 841.0327 861.8825 887.3387 922.8576 946.8220 981.6972 999.8049 1009.9397 1010.4853 1018.0470 1029.5114 1051.9171 1072.3862 1079.5314 1083.2765 1091.9479 1121.6382 1131.7074 1141.0235 1177.6980 1191.4010 1206.9994 1218.1598 1228.9585 1249.7691 1257.6384 1264.7388 1280.2170 1284.1162 1289.3748 1291.6991 1294.7044 1297.3312 1322.3686 1336.5232 1346.2181 1354.7042 1356.5410 1362.9021 1374.3788 1388.3764 1440.2581 1451.3377 1456.7395 1459.5676 1461.3642 1463.7847 1466.1098 1472.2231 1475.5436 1478.6506 1484.9276 1489.1894 1628.0596 1694.2286 2949.8326 2950.9403 2953.3661 2959.9475 2967.0387 2968.8008 2971.2613 2982.4250 2983.2824 2989.9283 3001.1653 3011.6910 3015.6310 3026.0907 3026.5060 3035.9469 3038.1598 3051.3864 3067.5313 3070.0588 3078.1555 3080.7211 3096.1200
redmass: 4.4459 5.2052 2.2699 2.2502 3.7952 1.8569 1.6212 2.8713 5.6291 1.8046 2.3176 3.2614 2.6026 5.3125 1.1357 3.4926 2.4322 4.0287 4.6254 3.0576 3.2369 2.6432 3.8619 3.6243 4.5852 2.8633 5.9305 3.4753 1.0650 1.0950 1.1705 1.2610 1.4915 1.6672 1.4850 1.9088 1.5523 2.5755 1.9396 3.1812 2.2181 2.2003 1.6582 2.2745 3.1764 2.9849 2.3027 2.2864 2.8030 2.7103 2.2645 1.2379 2.1607 1.6947 1.1133 1.3900 1.4522 1.6418 1.3457 1.3385 1.0242 1.1805 1.5083 1.0802 1.1774 1.3056 1.5088 1.8252 1.9076 1.6270 1.6724 1.4975 1.5631 1.2177 1.0752 1.0958 1.0992 1.0766 1.0748 1.0694 1.0793 1.0785 1.0448 1.0792 1.0890 1.0941 11.9869 11.3076 1.0588 1.0587 1.0592 1.0592 1.0592 1.0590 1.0368 1.0606 1.0963 1.0983 1.1006 1.0752 1.0877 1.0595 1.1019 1.0636 1.1039 1.1028 1.1007 1.0993 1.1032 1.1050 1.1016
irintensity: 0.1291 0.1148 0.2308 0.0417 0.4842 0.0121 0.5525 1.3186 13.5604 0.2221 0.0876 0.6399 0.5721 0.7653 0.0069 1.6973 2.5271 8.8556 12.4371 1.4177 0.0945 0.2002 0.0841 0.0318 4.3036 2.3925 34.4737 6.0388 14.5689 0.4088 4.4352 0.7246 18.9380 10.1101 6.9439 5.3224 3.2692 4.8357 7.4605 1.2358 1.2521 13.3704 0.3748 0.6533 1.9430 10.1104 2.1992 2.9088 6.4020 18.2092 80.0931 2.8409 48.3370 16.9607 0.1233 17.1335 10.2236 31.8025 5.2754 6.4809 0.3580 0.5613 1.6860 0.4543 4.0787 8.3880 34.4211 69.1991 80.3272 7.3560 5.9384 14.0728 33.3732 11.3649 0.7168 35.6258 16.9912 1.7396 0.3867 1.5717 1.1936 1.5622 12.2899 3.6050 2.0325 28.9313 551.7027 16.5333 0.3574 2.5818 0.0998 21.8997 9.8444 155.5408 35.4107 55.4472 0.1337 0.1587 0.0754 16.7416 6.7589 13.9264 2.3234 2.9718 86.7307 118.6695 99.0738 55.1574 0.0197 9.1747 10.2115
temp: 298.150 k
press: 1.00000 atm
elementType: 8 8 7 6 6 6 6 6 6 6 6 6 6 6 6 6 1 1 1 1 1 1 1 1 1 1 1 1 1 1 1 1 1 1 1 1 1 1 1
symmnumber: 1
zpe: 894180.5 jmol-1
zpe.correction: 0.340575 hartree
zpe.thermalcorrener: 0.359174 hartree
zpe.thermalcorrenthalpy: 0.360118 hartree
zpe.thermalcorrgfe: 0.290559 hartree
zpe.sumelectzpe: -713.138721 hartree
zpe.sumelectthermal: -713.120123 hartree
zpe.sumelectthermalent: -713.119178 hartree
zpe.sumelectthermalfe: -713.188737 hartree
dipole: -0.1497 1.1096 0.9172
dipole: 1.4473
quadrupole: -95.2982 -101.4786 -104.6379
quadrupole: -10.0740 -1.7485 12.9682
quadrupole: 5.1734 -1.0070 -4.1664 -10.0740 -1.7485 12.9682
hfenergy: -713.4792962 hartree
pointgroup: C01 [X(C13H23N1O2)]
dipole: 0.0602048 -0.4376848 0.3592278 debye
polarizability: 167.0668867|0.1173529|147.0691161|8.7984365|5.694356|136.462833 unknown
InChI: InChI=1S/C13H23NO2/c1-2-3-4-5-6-7-8-11-14-12(15)9-10-13(14)16/h2-11H2,1H3
charge 0 multiplicity 1
39 atoms
O  3.73059 1.439169 1.541888
O  2.584757 -1.598461 -1.839728
N  3.006592 0.144756 -0.296632
C  -0.054175 0.632623 -0.678938
C  -1.431281 1.145267 -0.200913
C  1.047832 1.70889 -0.570146
C  -2.546066 0.079454 -0.295366
C  2.433106 1.254764 -1.08492
C  -3.922577 0.593232 0.183903
C  -5.041363 -0.468442 0.089154
C  4.090794 -1.038907 1.46882
C  3.70508 -2.041433 0.355282
C  3.613345 0.329852 0.967828
C  3.03322 -1.201086 -0.738309
C  -6.417121 0.049077 0.568166
C  -7.530819 -1.015834 0.469937
H  0.22931 -0.257217 -0.080321
H  -0.129748 0.284313 -1.729062
H  -1.721601 2.032128 -0.802721
H  -1.348542 1.497136 0.84897
H  0.753822 2.597101 -1.165373
H  1.147438 2.051829 0.47763
H  -2.630106 -0.271124 -1.345249
H  -2.256855 -0.80857 0.30501
H  3.146024 2.097456 -1.035903
H  2.364117 0.894581 -2.127299
H  -3.837772 0.94247 1.23458
H  -4.210411 1.482373 -0.415713
H  -4.756447 -1.358173 0.689266
H  -5.128315 -0.81818 -0.961056
H  3.608371 -1.254764 2.43748
H  5.177463 -0.991567 1.654246
H  4.572801 -2.565978 -0.079627
H  2.997379 -2.817439 0.694058
H  -6.699543 0.938339 -0.031906
H  -6.329283 0.398265 1.617458
H  -8.503435 -0.619739 0.815897
H  -7.287669 -1.901468 1.087218
H  -7.658109 -1.360896 -0.573708
