program: Gaussian 09
title: 000125119
version: EM64L-G09RevD.01
frameworkgroup: C1[X(C27H21N3)]
method: RPBEPBE
basis: SDD
operation: Freq
keyword: #pfreq=noraman
keyword: PBEPBE/SDD
title: #p freq=noraman PBEPBE/SDD
converged: YES YES NO NO
title: Mulliken charges:
elementType: N N N C C C C C C C C C C C C C C C C C C C C C C C C C C C H H H H H H H H H H H H H H H H H H H H H
charge: -0.465787 -0.465905 -0.465696 0.233301 0.234331 0.232771 -0.723978 -0.724782 -0.723015 0.248749 0.248280 0.246895 0.155732 0.156442 0.156162 0.203369 0.203295 0.203212 -0.424519 -0.423922 -0.424268 -0.368802 -0.368829 -0.368869 -0.261662 -0.261736 -0.261902 -0.222663 -0.222591 -0.222681 0.225968 0.219478 0.219507 0.225941 0.226019 0.219149 0.306875 0.307322 0.307290 0.206373 0.205536 0.205999 0.229660 0.229726 0.229709 0.217848 0.217797 0.217878 0.220342 0.220332 0.220319
chargesum: 0.00000
title: Mulliken charges with hydrogens summed into heavy atoms:
elementType: N N N C C C C C C C C C C C C C C C C C C C C C C C C C C C
charge: -0.158912 -0.158583 -0.158406 0.233301 0.234331 0.232771 -0.278503 -0.279363 -0.277847 0.248749 0.248280 0.246895 0.155732 0.156442 0.156162 0.203369 0.203295 0.203212 -0.218146 -0.218386 -0.218269 -0.139142 -0.139102 -0.139160 -0.043814 -0.043939 -0.044024 -0.002321 -0.002259 -0.002362
polarizability: 3.51091095e+02 -6.93931665e-02 3.48873882e+02 -2.60466310e-01 -1.56484953e-01 2.35579306e+02
1716.lowfreq: 0.0006 0.0007 0.0008 2.6833 4.6607 9.0930 27.6944 28.0557 30.1898
frequency: 27.6628 27.9422 30.1216 83.5573 84.9043 89.4116 124.3675 124.6643 170.4703 171.2091 175.7846 189.0470 275.9288 278.5740 285.0391 296.4013 296.6491 337.3912 342.7873 343.3006 387.2322 432.4307 433.2709 434.1375 487.7789 489.1655 498.7269 500.0037 503.9843 509.5140 513.4558 515.4897 538.9139 558.3565 558.5373 571.2149 580.2519 580.3865 603.9830 637.0768 637.6050 653.4459 678.6721 710.5831 710.9834 730.2221 740.4857 740.7952 746.8751 751.2801 752.0788 767.0479 788.8353 789.6056 817.5324 840.2157 840.6333 846.9383 848.7970 849.4275 871.6878 872.1893 880.4101 923.9155 924.1421 925.0154 932.9000 964.2709 964.3685 964.7045 983.5031 983.8146 1011.6056 1013.0853 1013.6054 1095.1214 1098.5492 1099.2326 1129.5242 1132.0536 1132.4683 1159.2808 1159.7974 1164.6778 1169.6972 1169.8875 1191.2913 1237.3077 1238.1726 1238.3671 1250.9698 1251.4428 1254.0305 1297.4071 1299.4551 1299.5469 1309.9028 1317.2804 1317.5631 1342.6380 1346.4234 1347.1661 1406.5413 1406.8810 1407.1964 1430.6573 1431.1744 1432.6455 1456.5297 1458.8589 1465.9364 1467.7067 1467.9583 1476.3018 1481.1785 1481.5558 1484.1658 1571.1065 1573.9399 1574.2503 1588.5753 1588.8347 1588.9646 1631.9703 1632.1149 1632.4492 2981.1637 2981.8584 2983.2036 3037.9784 3038.7331 3042.3163 3104.4175 3106.0550 3106.5974 3126.4388 3126.4814 3126.7929 3139.6890 3139.9107 3139.9921 3160.3013 3160.5414 3160.8140 3598.8228 3599.6220 3599.8187
redmass: 5.5551 5.5579 5.8226 4.5930 4.6373 4.2441 5.2410 5.2017 5.1218 5.1596 5.1712 5.3465 2.4510 2.5041 4.9261 4.7686 4.6508 1.9366 5.9817 5.7652 5.1342 3.1002 3.0399 3.0389 2.5139 2.5401 1.8109 1.9373 1.5385 2.7624 2.1195 1.8511 5.4396 4.8969 4.8827 4.1670 3.7424 3.7378 5.4471 5.5690 5.5578 5.6599 5.5989 4.6484 4.6505 5.1031 1.5392 1.5255 1.3465 3.2629 3.2474 3.8064 4.3974 4.4388 2.6363 2.4538 2.5043 1.5744 1.8495 1.7979 4.0060 3.9351 3.7064 1.3890 1.3883 1.3873 2.8211 1.2970 1.2975 1.2964 2.9898 3.0066 2.0183 1.9889 1.9931 2.5446 2.4432 2.4509 1.6268 1.8881 1.9045 1.3571 1.3251 1.0981 1.2190 1.2391 1.5302 1.6632 1.6647 1.6614 1.8865 1.8510 1.5466 1.4765 1.4458 1.4122 3.3915 2.4877 2.4923 1.7542 2.1218 2.1290 5.4529 5.4692 5.2307 2.7157 2.7360 2.8021 1.1249 1.1473 4.4826 4.8594 4.6114 1.5426 2.9116 2.9325 1.7899 7.8876 7.1538 7.1394 6.3266 6.1001 6.0928 6.9422 6.9762 6.9788 1.0623 1.0620 1.0626 1.0983 1.0978 1.0972 1.0879 1.0875 1.0874 1.0870 1.0870 1.0869 1.0939 1.0939 1.0939 1.0998 1.0997 1.0997 1.0805 1.0804 1.0804
irintensity: 0.1111 0.1085 0.1356 0.9055 0.9485 0.6881 2.4072 2.4061 0.4836 0.4673 0.7091 3.2621 0.1126 0.0493 4.1753 4.1578 4.2127 0.1021 2.5393 2.4531 2.7711 8.2712 9.0523 9.0705 19.8770 20.1500 39.9569 38.4804 53.9684 40.7439 44.3072 54.4005 0.1619 0.6864 0.7643 0.8444 3.0855 2.9816 5.0140 3.1277 3.1136 9.6354 0.1970 2.1460 2.2321 4.3492 64.6177 64.8575 152.1329 12.2104 12.8003 13.4737 6.4448 5.9759 4.7080 1.2343 1.0881 0.4585 0.9233 0.9320 0.0332 0.0377 0.3373 2.9058 3.4585 3.6775 0.5785 0.0781 0.0832 0.0568 0.7087 0.5666 7.1474 14.3726 15.0300 3.3029 10.2866 9.9497 0.2697 25.1354 25.4732 2.1881 2.1644 0.7063 2.2637 2.0836 5.6083 21.7613 20.0982 21.0386 4.3380 3.5499 0.4821 2.3699 3.5239 4.1838 5.8978 38.3354 37.9740 17.9079 8.0505 7.9285 47.5222 45.1614 25.1792 14.0149 14.2137 6.0718 9.5400 12.3327 32.8058 47.8916 43.6916 23.4195 6.8355 7.5390 9.0197 0.3363 10.7426 10.2010 0.9801 10.1169 10.2827 1.8679 1.4164 1.3929 55.2663 33.4427 31.6366 16.3552 13.7027 14.8465 18.4630 17.8165 19.8278 0.6266 1.1143 0.8564 17.2169 34.4797 47.9228 36.8360 35.4343 32.4563 38.0406 36.6990 49.0303
temp: 298.150 k
press: 1.00000 atm
elementType: 7 7 7 6 6 6 6 6 6 6 6 6 6 6 6 6 6 6 6 6 6 6 6 6 6 6 6 6 6 6 1 1 1 1 1 1 1 1 1 1 1 1 1 1 1 1 1 1 1 1 1
symmnumber: 1
zpe: 1071906.0 jmol-1
zpe.correction: 0.408267 hartree
zpe.thermalcorrener: 0.430503 hartree
zpe.thermalcorrenthalpy: 0.431447 hartree
zpe.thermalcorrgfe: 0.357199 hartree
zpe.sumelectzpe: -1203.752688 hartree
zpe.sumelectthermal: -1203.730453 hartree
zpe.sumelectthermalent: -1203.729509 hartree
zpe.sumelectthermalfe: -1203.803756 hartree
dipole: 0.0140 -0.0098 0.7518
dipole: 0.7520
quadrupole: -163.8980 -164.0572 -171.0781
quadrupole: 0.0781 -0.0411 0.0619
quadrupole: 2.4464 2.2873 -4.7337 0.0781 -0.0411 0.0619
hfenergy: -1204.1609556 hartree
pointgroup: C01 [X(C27H21N3)]
dipole: 0.0030209 0.0057266 -0.2957932 debye
polarizability: 350.5512647|0.9544228|349.4137191|0.2776281|-0.1178452|235.5792995 unknown
InChI: InChI=1S/C27H21N3/c1-4-10-22-16(7-1)19-13-26-21(18-9-3-5-11-23(18)29-26)15-27-20(14-25(19)28-22)17-8-2-6-12-24(17)30-27/h1-12,28-30H,13-15H2
charge 0 multiplicity 1
51 atoms
N  3.027454 0.125673 -0.26519
N  -1.621624 2.549455 -0.25129
N  -1.410376 -2.678835 -0.27323
C  1.403654 1.440974 -1.178469
C  0.542303 -1.932848 -1.184872
C  -1.949881 0.495499 -1.186188
C  0.168102 1.885484 -1.937471
C  1.545276 -1.085158 -1.943757
C  -1.712573 -0.79048 -1.955221
C  1.962294 0.156632 -1.183356
C  -1.116552 1.621063 -1.179584
C  -0.849291 -1.775961 -1.194415
C  2.158139 2.234398 -0.226237
C  0.851109 -2.976227 -0.225067
C  -3.012639 0.741399 -0.22966
C  3.171683 1.378784 0.338232
C  -2.777728 2.040715 0.349079
C  -0.397767 -3.424749 0.338185
C  2.09077 3.587606 0.200576
C  2.056822 -3.586198 0.21307
C  -4.148264 0.000119 0.192552
C  4.092696 1.83435 1.304871
C  -3.629331 2.597376 1.326604
C  -0.464673 -4.440707 1.314773
C  3.008394 4.049694 1.16491
C  1.997329 -4.601876 1.18792
C  -5.003592 0.550534 1.167687
C  3.997121 3.181037 1.714207
C  -4.744708 1.834423 1.731884
C  0.749644 -5.022531 1.735857
H  0.243117 2.964532 -2.177275
H  1.119855 -0.771702 -2.914999
H  0.111477 1.363142 -2.91028
H  2.440697 -1.690345 -2.187698
H  -2.682283 -1.262273 -2.20959
H  -1.220817 -0.570249 -2.920521
H  3.563669 -0.70904 -0.03627
H  -1.166374 3.428235 -0.012049
H  -2.40129 -2.722908 -0.043523
H  1.349488 4.275643 -0.226368
H  3.024232 -3.2884 -0.211945
H  -4.374278 -0.980966 -0.245151
H  4.857038 1.17247 1.727434
H  -3.437417 3.584997 1.760912
H  -1.420733 -4.770203 1.736951
H  2.969073 5.092458 1.499443
H  2.920225 -5.081976 1.532278
H  -5.884535 -0.010265 1.499749
H  4.695532 3.56788 2.464567
H  -5.425485 2.235209 2.491098
H  0.734919 -5.812584 2.494837
