program: Gaussian 09
title: 000125117
version: EM64L-G09RevD.01
frameworkgroup: C1[X(C10H10O6S)]
method: RPBEPBE
basis: SDD
operation: Freq
keyword: #p
keyword: freq=noraman
keyword: PBEPBE/SDD
title: #p freq=noraman PBEPBE/SDD
converged: YES YES NO NO
title: Mulliken charges:
elementType: S O O O O O O C C C C C C C C C C H H H H H H H H H H
charge: 1.194449 -0.261781 -0.253849 -0.443002 -0.544806 -0.482697 -0.449586 0.587784 -0.329026 0.199799 -0.450399 0.173038 -0.441767 -0.320931 -0.202461 -0.032491 -0.551577 0.254110 0.269691 0.243122 0.258769 0.243834 0.244826 0.241905 0.227331 0.230546 0.395170
chargesum: 0.00000
title: Mulliken charges with hydrogens summed into heavy atoms:
elementType: S O O O O O O C C C C C C C C C C
charge: 1.194449 -0.261781 -0.253849 -0.443002 -0.149636 -0.482697 -0.449586 0.587784 -0.074916 0.199799 -0.180707 0.173038 -0.198644 -0.062162 0.286199 0.209414 -0.093701
polarizability: 2.92068730e+02 -1.29966944e+01 1.27068810e+02 6.80637432e+00 6.73374921e+00 1.35453084e+02
1716.lowfreq: -15.0819 -0.0011 0.0007 0.0017 0.6418 4.9852 6.7751 21.2204 40.9403
frequency: -14.5100 21.1312 40.8408 45.3797 59.7638 70.5606 117.3193 127.8032 155.2089 177.1454 188.6007 221.7635 259.9486 276.6753 314.5018 323.8484 329.1505 362.2744 369.6306 411.8849 423.8491 457.5173 480.1577 553.7691 569.1367 595.7410 619.8646 673.3272 683.3528 722.5733 768.6650 793.5257 805.4841 829.3370 838.5837 865.4797 873.2601 907.3574 934.7367 958.5453 972.2052 979.9720 989.1738 996.2337 1064.2958 1064.4706 1102.6936 1116.6157 1120.3619 1155.9985 1190.5223 1240.2982 1259.3553 1283.4887 1286.7454 1314.7860 1365.4413 1403.0727 1439.7952 1447.2522 1473.6229 1486.5246 1605.5222 1622.0265 1651.8391 3021.0671 3027.3933 3097.5536 3101.9097 3126.0197 3147.7052 3183.5710 3187.0986 3208.2833 3458.4539
redmass: 2.2769 5.8753 10.5047 8.2103 6.8922 3.6393 3.7499 4.6689 3.7732 3.8753 4.3256 5.1228 4.1318 2.1871 10.1627 4.6352 6.8007 5.1807 5.5653 3.9916 3.1138 4.0248 10.7491 7.7877 9.5382 4.6257 5.5746 3.5389 5.5432 4.1690 5.7168 3.6553 2.2424 2.4092 8.3236 6.0648 1.6641 2.6567 1.3799 2.3173 1.3378 3.4388 9.0858 1.2468 3.6011 1.4815 1.2328 1.7669 1.0368 1.7622 1.7490 1.5082 2.7089 1.2007 1.3944 1.5624 1.2812 3.0173 1.2713 4.4454 2.3583 1.3006 7.7639 8.2142 4.4990 1.0535 1.0865 1.0606 1.1192 1.0944 1.0902 1.0935 1.0957 1.1146 1.0655
irintensity: 13.5081 0.8625 0.7453 3.0626 0.1643 1.9097 15.2182 6.5642 24.9040 17.7947 1.3762 8.5456 2.1744 40.9268 40.7453 1.0866 7.0377 22.9789 38.4898 1.9477 25.4378 3.6503 9.4281 22.3913 168.0601 9.4156 2.2745 12.7843 5.1514 0.3835 10.9554 31.6944 127.5131 36.5882 31.1311 121.9289 2.8751 6.4463 1.7747 46.3054 98.5735 139.1803 59.5775 2.8926 27.5278 4.7945 123.6176 4.4360 0.0297 16.1726 18.6569 80.2369 251.7837 25.2818 14.0460 14.1877 5.9441 7.6451 32.2276 104.9834 138.1030 39.4966 20.4259 45.5823 2.4821 128.9217 8.6770 4.3888 26.3867 3.0768 3.5242 1.0459 3.9736 12.3969 50.6202
temp: 298.150 k
press: 1.00000 atm
elementType: 16 8 8 8 8 8 8 6 6 6 6 6 6 6 6 6 6 1 1 1 1 1 1 1 1 1 1
symmnumber: 1
zpe: 486994.1 jmol-1
zpe.correction: 0.185486 hartree
zpe.thermalcorrener: 0.202219 hartree
zpe.thermalcorrenthalpy: 0.203163 hartree
zpe.thermalcorrgfe: 0.139020 hartree
zpe.sumelectzpe: -1234.951591 hartree
zpe.sumelectthermal: -1234.934859 hartree
zpe.sumelectthermalent: -1234.933915 hartree
zpe.sumelectthermalfe: -1234.998058 hartree
dipole: 6.4587 1.4173 0.9082
dipole: 6.6744
quadrupole: -116.6899 -102.9029 -104.6559
quadrupole: -9.8719 -4.9050 -2.3810
quadrupole: -8.6070 5.1800 3.4270 -9.8719 -4.9050 -2.3810
hfenergy: -1235.1370776 hartree
pointgroup: C01 [X(C10H10O6S1)]
dipole: 2.5396133 0.6622183 0.0851731 debye
polarizability: 292.6613477|-8.6730577|132.0273631|6.2525724|8.1945856|129.9019138 unknown
InChI: InChI=1S/C10H10O6S/c1-2-8(16-17(11,12)13)7-3-4-9-10(5-7)15-6-14-9/h2-5,8,11H,1,6H2
charge 0 multiplicity 1
27 atoms
S  -3.640085 -0.729812 0.298676
O  3.275003 -1.159593 -1.364008
O  4.381935 -0.190697 0.53573
O  -1.766197 -0.641883 0.182646
O  -3.530513 -2.239082 1.320958
O  -4.160706 0.526353 1.158922
O  -4.378952 -1.145628 -1.056491
C  0.2718 0.525228 0.153513
C  -1.2144 0.760475 -0.030119
C  2.355459 -0.430526 -0.57313
C  0.993551 -0.257892 -0.800857
C  3.010252 0.135956 0.545506
C  0.930929 1.076648 1.281712
C  2.323002 0.897224 1.494835
C  4.591736 -1.016395 -0.689069
C  -1.637743 1.285411 -1.379581
C  -2.427848 2.376882 -1.529559
H  -1.610651 1.408455 0.773948
H  0.498605 -0.719072 -1.658455
H  0.354428 1.66293 2.005142
H  2.834856 1.330071 2.357317
H  5.287458 -0.485907 -1.361143
H  4.954672 -2.013573 -0.388707
H  -1.285484 0.729233 -2.257959
H  -2.726311 2.732514 -2.521312
H  -2.807474 2.939101 -0.667556
H  -2.592522 -2.243519 1.67714
