program: Gaussian 09
title: 000125110
version: EM64L-G09RevD.01
frameworkgroup: C1[X(C8H9FN2O3)]
method: RPBEPBE
basis: SDD
operation: Freq
keyword: #p
keyword: freq=noraman
keyword: PBEPBE/SDD
title: #p freq=noraman PBEPBE/SDD
converged: YES YES NO NO
title: Mulliken charges:
elementType: F O O O N N C C C C C C C C H H H H H H H H H
charge: -0.162943 -0.243316 -0.230602 -0.256064 -0.242636 -0.365112 -0.004194 -0.483030 -0.440047 -0.289149 0.204424 0.228223 0.201414 -0.238254 0.265122 0.266119 0.239339 0.227075 0.227527 0.218545 0.239889 0.357196 0.280475
chargesum: 0.00000
title: Mulliken charges with hydrogens summed into heavy atoms:
elementType: F O O O N N C C C C C C C C
charge: -0.162943 -0.243316 -0.230602 -0.256064 -0.242636 -0.007915 0.260928 0.022427 0.014554 0.169285 0.204424 0.228223 0.201414 0.042221
polarizability: 1.33457568e+02 -9.65877098e+00 1.18955323e+02 6.76129669e-01 6.60144868e-01 6.56487253e+01
1716.lowfreq: -9.6788 -0.0014 -0.0010 -0.0010 7.7803 10.7024 62.0016 71.5761 99.3063
frequency: 61.9469 71.4916 99.2734 113.9489 173.5746 211.0594 255.8530 273.2498 307.0728 332.7759 363.6817 402.4288 447.4344 474.8916 535.3251 558.7880 599.6120 621.4667 649.6610 689.5821 718.4015 737.8488 774.0507 839.3062 855.4874 866.5451 877.3558 910.9813 918.2604 954.4637 1023.3352 1029.3712 1054.7960 1101.0808 1142.6220 1152.6523 1171.7445 1178.4098 1226.7765 1233.7433 1290.8425 1303.1850 1311.4577 1320.9990 1341.8789 1364.3370 1399.7860 1443.7501 1460.5251 1468.9672 1479.4945 1598.4177 1656.8124 1668.5574 3014.7386 3026.2156 3040.8431 3072.6264 3082.4372 3103.2139 3114.6572 3197.5580 3566.2670
redmass: 4.8393 5.6101 3.3115 9.9518 7.7202 3.8234 2.4353 6.5848 9.4213 9.0329 4.1302 11.3013 12.6038 4.8030 6.4920 3.2621 2.6911 1.2503 4.1654 6.0850 5.7215 10.9265 8.4182 3.1258 2.1411 1.3800 3.3133 1.9403 2.3678 3.7470 4.3339 3.3373 1.8545 2.3912 2.1050 3.4695 1.5704 1.4515 1.8735 2.3675 1.3136 1.6791 1.4054 1.3087 1.2932 2.6859 1.2894 2.4919 1.0899 1.0901 1.1074 8.3510 7.5734 6.4273 1.0606 1.0594 1.0620 1.0897 1.1007 1.1082 1.1052 1.0956 1.0787
irintensity: 2.4007 8.0121 2.5635 5.4325 0.5580 0.0928 4.2020 11.0701 3.1878 0.7870 3.7414 8.9645 4.1954 0.3069 24.3324 1.0912 6.3582 94.4052 11.3502 11.6620 25.5865 28.4944 20.2785 18.0579 24.2356 22.0943 33.1309 11.1380 12.3350 69.2216 80.3070 3.7547 18.7268 25.1253 23.6573 107.7657 8.7815 5.5161 53.8725 89.2631 10.8815 60.0978 4.8658 2.4872 0.0993 28.2328 10.7186 12.0526 5.9897 14.5804 33.3287 484.8597 263.2576 98.6978 29.3081 53.3349 18.8763 1.6262 18.3016 14.8504 31.5839 1.6550 101.9026
temp: 298.150 k
press: 1.00000 atm
elementType: 9 8 8 8 7 7 6 6 6 6 6 6 6 6 1 1 1 1 1 1 1 1 1
symmnumber: 1
zpe: 450620.8 jmol-1
zpe.correction: 0.171632 hartree
zpe.thermalcorrener: 0.183506 hartree
zpe.thermalcorrenthalpy: 0.184450 hartree
zpe.thermalcorrgfe: 0.133280 hartree
zpe.sumelectzpe: -744.226205 hartree
zpe.sumelectthermal: -744.214332 hartree
zpe.sumelectthermalent: -744.213388 hartree
zpe.sumelectthermalfe: -744.264558 hartree
dipole: -2.1153 1.4286 1.6047
dipole: 3.0151
quadrupole: -56.2690 -95.6657 -82.2472
quadrupole: -8.8419 3.5617 1.6549
quadrupole: 21.7917 -17.6051 -4.1866 -8.8419 3.5617 1.6549
hfenergy: -744.3978377 hartree
pointgroup: C01 [X(C8H9F1N2O3)]
dipole: 0.8236149 -0.697201 0.4926145 debye
dipolederiv: -0.3320904 -0.3343698 -0.0831337 -0.2948744 -0.7830651 -0.171992 -0.0774206 -0.166325 -0.1543617 -0.8290574 0.1763507 0.0607914 0.3100411 -0.5251254 0.0843648 -0.1572083 0.0993958 -0.4777723 -0.7777588 0.374334 0.1307437 0.211056 -0.8309362 -0.1446514 0.0942363 -0.1524508 -0.3599427 -0.5780639 -0.2235596 -0.0456181 -0.1034687 -1.2445268 -0.2157511 -0.0232437 -0.2061654 -0.4122696 -0.9141992 0.1886418 -0.0014137 -0.0050763 -1.1493165 -0.2438608 0.0240417 -0.2160681 -0.3101658 -0.7337577 -0.6124807 -0.1451926 0.1896734 -0.8192241 -0.1396849 0.0763967 -0.1069561 -0.3467809 1.237368 -0.1072828 0.0509813 -0.0037127 0.3266753 -0.1453558 0.327457 -0.2014868 0.4535195 -0.1236648 0.0518548 0.0657732 0.1020395 0.082052 0.0238334 -0.0236162 -0.0306659 -0.0783891 0.0648724 0.0369179 0.0047656 0.0656329 0.0603499 0.1211263 0.1239239 0.088839 -0.0295257 0.5086067 -0.1514688 -0.0008644 -0.1999611 0.3922515 -0.0310995 -0.1487601 0.113595 0.2760218 1.0919918 -0.4142331 -0.1691886 -0.0240577 1.1900776 0.2571058 -0.0367486 0.2494858 0.3432407 1.2274579 0.3368417 0.0473102 -0.1236104 1.6670929 0.3408763 -0.0982867 0.3243264 0.373431 -0.2183009 0.6612159 0.1921905 0.4095712 0.698606 0.176222 0.1337576 0.1526049 0.0286091 0.0740217 0.1850487 0.0440393 -0.3383505 0.6961105 0.2061161 -0.0984226 0.1810516 0.0241382 0.0592573 0.0304505 0.0017743 -0.0416562 -0.0059619 0.0068337 -0.0105571 -0.0017704 0.0472681 0.0285131 -0.0424117 -0.084429 -0.0250349 0.0357557 -0.0883131 -0.0969801 -0.0125327 0.0298274 0.0551133 -0.0038321 0.0119062 -0.0449313 -0.0705477 0.1246718 0.0153516 0.0804503 0.0198662 -0.064416 -0.0770775 -0.034491 -0.1433418 -0.0377241 -0.0064139 -0.0704784 -0.0316139 0.0470275 0.0082299 0.0425018 0.0664231 0.0929369 0.0161747 -0.0990183 0.0970375 -0.0934025 -0.0174279 -0.0895748 0.0780158 -0.1047959 0.0438121 0.0650455 0.0144668 -0.1100068 0.0575434 -0.0459677 0.0704592 -0.0843313 0.0102913 -0.0143912 -0.0922422 -0.0143446 0.0640819 -0.0813117 0.0482207 0.2246217 -0.0787588 -0.0166744 -0.0621526 0.2237297 -0.0290641 -0.0115069 -0.0220035 0.3467938 0.010371 -0.0323673 -0.0011886 -0.0001434 0.1047486 -0.0260675 0.0069521 -0.0245392 0.1946393 unknown
polarizability: 133.2487473|-9.475609|116.8531198|-2.5848773|10.9103355|67.9597498 unknown
InChI: InChI=1S/C8H9FN2O3/c9-5-4-10-8(13)11(7(5)12)6-2-1-3-14-6/h4,6,10H,1-3H2
charge 0 multiplicity 1
23 atoms
F  2.536486 2.203318 0.632577
O  -1.943492 0.045383 -1.183322
O  -0.2381 1.736447 0.607627
O  0.54909 -2.785017 -0.577386
N  0.111424 -0.524701 0.003988
N  2.33703 -1.330411 -0.286546
C  -1.370393 -0.781601 -0.12375
C  -2.177686 -0.516752 1.178125
C  -3.458886 0.197195 0.666354
C  -2.950183 0.961994 -0.571226
C  0.560883 0.80163 0.332871
C  0.95804 -1.623516 -0.30712
C  2.022827 0.946475 0.319217
C  2.867789 -0.083133 0.015267
H  -1.429418 -1.831009 -0.452221
H  -1.618023 0.144002 1.857302
H  -2.396916 -1.461924 1.701454
H  -4.223778 -0.543792 0.371885
H  -3.892714 0.869127 1.426254
H  -3.717592 1.133815 -1.342792
H  -2.453898 1.907516 -0.291737
H  2.943135 -2.121054 -0.511979
H  3.953175 0.034107 0.000559
