program: Gaussian 09
title: 000125108
version: EM64L-G09RevD.01
frameworkgroup: C1[X(C12H15NO2)]
method: RPBEPBE
basis: SDD
operation: Freq
keyword: #p
keyword: freq=noraman
keyword: PBEPBE/SDD
title: #p freq=noraman PBEPBE/SDD
converged: YES YES NO NO
title: Mulliken charges:
elementType: O O N C C C C C C C C C C C C H H H H H H H H H H H H H H H
charge: -0.232158 -0.242677 -0.425174 0.309262 -0.569729 -0.493625 -0.237740 0.177734 0.250805 -0.679160 -0.351246 -0.358367 -0.222962 -0.237774 -0.226589 0.242690 0.242284 0.253942 0.259894 0.305141 0.193126 0.193845 0.201699 0.236826 0.227042 0.274655 0.212977 0.233095 0.229273 0.232912
chargesum: 0.00000
title: Mulliken charges with hydrogens summed into heavy atoms:
elementType: O O N C C C C C C C C C C C C
charge: -0.232158 -0.242677 -0.120033 0.309262 -0.084755 0.020211 0.149230 0.177734 0.250805 -0.013592 -0.076591 -0.145390 0.010132 -0.008501 0.006323
polarizability: 1.85394711e+02 6.42546372e+00 1.29936916e+02 -4.41566486e+00 1.99297792e+01 1.06947522e+02
1716.lowfreq: -12.9036 -7.5847 -3.7599 -0.0004 -0.0004 0.0003 25.9855 31.3571 53.3024
frequency: 25.8770 31.2861 53.2174 58.8796 100.7273 110.8820 164.9750 175.2288 199.4598 228.9439 278.8866 315.3030 324.0183 392.5764 403.0546 415.7236 461.6041 491.1548 535.8522 552.0644 614.5698 657.9380 690.0607 705.0713 739.1994 774.6800 796.1119 816.7248 818.2897 844.5300 856.0899 916.8352 934.4121 942.1917 955.4082 983.5348 989.5050 998.8270 1005.8323 1025.4935 1038.0566 1042.8391 1075.5694 1081.1346 1105.3440 1118.4515 1135.8362 1154.8712 1173.4357 1188.9711 1207.7552 1245.5056 1252.7022 1313.3026 1328.7820 1363.5246 1384.6551 1394.8618 1422.6213 1431.4626 1450.9146 1458.0134 1459.2071 1478.5910 1483.4735 1490.2448 1579.9988 1609.5466 1616.4823 2934.0187 2987.6004 2994.7066 3091.7659 3094.3892 3102.9460 3114.8708 3125.2917 3131.6227 3144.3350 3157.4302 3169.3097 3202.4112 3236.2920 3540.3229
redmass: 3.8238 3.9123 3.3175 2.2912 4.7141 3.2508 4.1805 3.5549 3.8203 1.2476 4.0482 2.9878 3.5099 4.2117 2.9288 3.1328 4.5663 3.8637 3.6866 1.2854 6.2731 6.1346 4.6020 1.5079 3.4389 1.0959 2.5005 1.0996 3.8637 2.7806 1.3120 1.9357 1.4263 1.5731 4.2307 1.4150 5.5182 5.3874 1.3507 2.3034 2.3856 1.4216 1.4023 1.6200 2.6404 2.2145 1.4315 1.3044 1.0584 1.1187 2.6627 1.2503 2.5271 1.3856 2.5106 1.3490 9.2952 1.2594 1.1569 2.0233 1.7902 1.2171 1.1975 1.0767 2.1092 1.0866 6.4350 6.0967 7.6406 1.0556 1.1059 1.0360 1.0989 1.0551 1.1010 1.0874 1.0585 1.0869 1.0919 1.0956 1.1007 1.1170 1.1164 1.0769
irintensity: 0.1518 0.1443 2.8634 1.7057 2.3963 5.4865 0.3376 0.9007 1.5612 0.1768 9.4721 0.9030 5.1510 3.0139 0.6959 3.7783 21.9946 6.3206 1.4794 79.4929 0.7946 10.9725 4.4255 108.8877 9.0693 1.3115 18.2769 0.8474 6.5962 4.3510 1.2666 12.7653 2.2074 17.9413 24.8921 1.6681 0.5013 8.1435 2.0717 9.4381 52.6104 70.3822 12.7000 14.6023 3.2711 5.4631 8.8691 0.8693 1.1591 9.0994 213.9059 19.1073 98.7706 3.6088 76.3139 0.7021 1.2060 22.1905 53.3035 16.9321 280.8210 22.9156 11.5285 8.1925 41.0617 7.5771 46.6327 18.3481 86.2014 52.2444 54.2708 26.8779 30.2630 12.0600 34.8436 14.2728 2.8723 1.8849 22.6086 15.8186 21.3176 8.6281 9.2309 10.2164
temp: 298.150 k
press: 1.00000 atm
elementType: 8 8 7 6 6 6 6 6 6 6 6 6 6 6 6 1 1 1 1 1 1 1 1 1 1 1 1 1 1 1
symmnumber: 1
zpe: 642983.7 jmol-1
zpe.correction: 0.244900 hartree
zpe.thermalcorrener: 0.259721 hartree
zpe.thermalcorrenthalpy: 0.260665 hartree
zpe.thermalcorrgfe: 0.201096 hartree
zpe.sumelectzpe: -670.324362 hartree
zpe.sumelectthermal: -670.309540 hartree
zpe.sumelectthermalent: -670.308596 hartree
zpe.sumelectthermalfe: -670.368165 hartree
dipole: 0.9517 2.6429 4.1512
dipole: 5.0122
quadrupole: -76.1952 -85.5339 -92.3952
quadrupole: -1.5769 -3.6706 0.4353
quadrupole: 8.5129 -0.8258 -7.6871 -1.5769 -3.6706 0.4353
hfenergy: -670.5692612 hartree
pointgroup: C01 [X(C12H15N1O2)]
dipole: -0.4129593 -0.581523 -1.8384677 debye
polarizability: 185.8464229|-5.2283193|96.5628415|0.8995088|-7.9178998|139.8698839 unknown
InChI: InChI=1S/C12H15NO2/c1-2-15-12(8-9-12)13-11(14)10-6-4-3-5-7-10/h3-7,13H,2,8-9H2,1H3
charge 0 multiplicity 1
30 atoms
O  2.880512 0.539413 0.123005
O  0.026399 0.103149 2.041505
N  0.745372 -0.644104 -0.054756
C  2.154414 -0.700308 0.260028
C  2.911521 -1.99846 -0.066304
C  2.643679 -1.568378 1.396386
C  2.942396 1.04457 -1.265677
C  -0.230697 -0.186146 0.836657
C  -1.630452 -0.088069 0.275012
C  3.804871 2.305809 -1.243724
C  -2.705235 -0.105612 1.200429
C  -1.912379 0.051678 -1.109817
C  -4.038136 -0.013268 0.750458
C  -3.247585 0.149599 -1.560202
C  -4.313926 0.109623 -0.632416
H  3.933192 -1.887491 -0.44118
H  2.354882 -2.853794 -0.462453
H  1.892506 -2.110463 1.973877
H  3.483344 -1.173206 1.971886
H  0.448671 -0.96882 -0.976139
H  3.379593 0.264438 -1.926822
H  1.915943 1.273653 -1.622483
H  3.880819 2.741294 -2.256853
H  3.363781 3.058691 -0.568493
H  4.821586 2.073851 -0.882619
H  -2.465439 -0.183072 2.265986
H  -1.100487 0.129706 -1.843719
H  -4.860841 -0.03362 1.47346
H  -3.455153 0.268003 -2.629396
H  -5.349251 0.184633 -0.983035
