program: Gaussian 09
title: 000125100
version: EM64L-G09RevD.01
frameworkgroup: C1[X(C15H12O5)]
method: RPBEPBE
basis: SDD
operation: Freq
keyword: #pfreq=noraman
keyword: PBEPBE/SDD
title: #p freq=noraman PBEPBE/SDD
converged: YES YES NO NO
title: Mulliken charges:
elementType: O O O O O C C C C C C C C C C C C C C C H H H H H H H H H H H H
charge: -0.247474 -0.194754 -0.426112 -0.471861 -0.431963 -0.391144 -0.362082 0.064333 0.546118 0.228203 0.244066 -0.496616 -0.431606 -0.346687 -0.508378 0.147966 0.197686 -0.385672 -0.363016 0.279228 0.265386 0.246067 0.222068 0.300489 0.231057 0.242724 0.253540 0.219394 0.251369 0.383715 0.380378 0.353578
chargesum: 0.00000
title: Mulliken charges with hydrogens summed into heavy atoms:
elementType: O O O O O C C C C C C C C C C C C C C C
charge: -0.247474 -0.194754 -0.042398 -0.091483 -0.078386 -0.125759 0.106054 0.064333 0.546118 0.228203 0.244066 -0.196127 -0.200549 -0.103964 -0.254838 0.147966 0.197686 -0.166277 -0.111647 0.279228
polarizability: 3.02321647e+02 -6.90957012e+00 1.53102255e+02 7.51607556e+00 8.74357913e+00 1.07275296e+02
1716.lowfreq: -7.1880 -1.9168 0.0005 0.0007 0.0008 6.6764 25.8614 31.4881 53.6183
frequency: 25.7824 31.3183 53.5720 89.9695 118.6681 152.8272 168.8639 204.8815 222.3242 236.6232 260.1148 285.2465 325.8377 336.3059 353.8861 367.9227 374.2118 394.0060 410.9190 425.1767 428.3133 446.0388 459.6851 478.7519 511.1061 537.8247 578.2888 610.1642 631.5065 643.1810 690.1805 697.3155 720.6209 728.1125 749.8813 790.0761 796.4938 804.2114 830.4431 832.0333 845.9559 909.4536 924.6590 934.5199 954.9256 962.7609 1004.1046 1028.5445 1067.7619 1089.7767 1105.2365 1140.8576 1144.3652 1159.6344 1178.2710 1182.3836 1196.3843 1199.7776 1213.9201 1249.6020 1259.1824 1270.4929 1296.9275 1316.0308 1329.5647 1368.5671 1393.3499 1417.0837 1427.8334 1450.3082 1464.0830 1504.8064 1506.8713 1583.9761 1591.2902 1597.7605 1628.5319 1641.7572 2963.8692 2986.4779 3106.1476 3110.9534 3134.7547 3143.7389 3149.7973 3173.4914 3173.5232 3536.1589 3581.8142 3616.6470
redmass: 7.8510 4.1314 6.5699 7.2683 6.0474 5.9030 6.5566 6.0728 4.6358 5.9414 4.7442 5.1477 1.4482 2.9285 1.1203 6.1545 6.9838 5.0062 2.9542 4.3868 5.0374 1.3841 2.2036 8.0278 4.2871 3.2574 5.5655 6.1274 6.4799 5.7265 5.1965 5.9800 4.1529 3.5207 3.9299 4.5733 3.8200 1.4602 1.6957 1.5175 4.9726 1.4380 1.6892 2.3098 2.4923 1.7395 2.8381 2.4514 4.3282 2.0391 1.4504 1.6279 1.3886 2.1351 2.0018 1.1303 1.4011 1.3639 1.7420 2.4970 2.4772 1.9291 1.4947 1.9369 1.4474 1.6244 5.8415 5.3978 2.8380 3.3691 1.2341 3.6666 2.8855 10.4262 7.8542 6.6559 6.4808 7.6868 1.0797 1.0679 1.0994 1.0873 1.0966 1.0894 1.0923 1.0930 1.0953 1.0651 1.0660 1.0666
irintensity: 1.7251 1.2542 0.7299 0.0452 2.3716 0.5946 1.3577 3.9271 0.3683 1.6980 3.3230 6.6935 142.2686 40.5949 144.6055 0.8279 4.7841 17.0837 0.6701 2.0596 11.1248 123.8019 15.8181 1.0950 50.0447 48.2271 3.3398 25.1844 3.2535 0.7557 0.7311 25.9948 0.8553 8.9876 3.5961 47.4398 6.6729 23.2912 40.9249 22.3473 17.7039 21.8485 9.5651 9.0797 35.5599 10.5962 9.1749 22.9139 9.9140 363.6674 56.9583 177.6600 156.3596 20.3736 0.4402 17.1163 0.7818 18.0121 40.0799 19.7027 426.4043 109.6175 18.6344 119.9140 48.3544 41.8170 13.5707 30.9903 6.3810 21.5835 6.4978 360.2164 26.3308 172.7414 122.8974 8.0385 32.7600 72.9978 1.6279 52.7052 17.7596 18.5827 20.5405 9.8441 3.5560 8.0412 3.6628 97.0928 45.3842 93.7867
temp: 298.150 k
press: 1.00000 atm
elementType: 8 8 8 8 8 6 6 6 6 6 6 6 6 6 6 6 6 6 6 6 1 1 1 1 1 1 1 1 1 1 1 1
symmnumber: 1
zpe: 622186.0 jmol-1
zpe.correction: 0.236978 hartree
zpe.thermalcorrener: 0.254010 hartree
zpe.thermalcorrenthalpy: 0.254954 hartree
zpe.thermalcorrgfe: 0.191716 hartree
zpe.sumelectzpe: -953.484451 hartree
zpe.sumelectthermal: -953.467419 hartree
zpe.sumelectthermalent: -953.466475 hartree
zpe.sumelectthermalfe: -953.529713 hartree
dipole: -1.3438 5.7115 0.1567
dipole: 5.8696
quadrupole: -82.7156 -121.4325 -113.5329
quadrupole: -5.5051 12.1940 3.7389
quadrupole: 23.1781 -15.5388 -7.6393 -5.5051 12.1940 3.7389
hfenergy: -953.7214289 hartree
pointgroup: C01 [X(C15H12O5)]
dipole: 0.5322787 -2.214164 0.3832458 debye
polarizability: 302.2858946|-7.830556|149.6359746|-7.1442602|-14.8999294|110.7773291 unknown
InChI: InChI=1S/C15H12O5/c16-9-3-1-8(2-4-9)11-7-20-14-6-13(18)12(17)5-10(14)15(11)19/h1-6,11,16-18H,7H2
charge 0 multiplicity 1
32 atoms
O  1.060966 -2.096504 0.083468
O  -0.195858 1.928817 0.240404
O  4.943426 1.967171 -0.220539
O  5.702572 -0.624108 -0.228912
O  -6.363024 0.448972 -0.602898
C  -0.78593 -0.449841 0.548201
C  -0.331561 -1.700559 -0.242523
C  0.181409 0.72189 0.247682
C  -2.255682 -0.166549 0.279216
C  1.598443 0.326589 0.045855
C  1.985588 -1.046703 0.019281
C  2.606213 1.329132 -0.045742
C  -3.243174 -0.583369 1.20322
C  -2.680058 0.455789 -0.925017
C  3.347408 -1.413854 -0.065598
C  3.955079 0.980894 -0.138645
C  4.317013 -0.401847 -0.138421
C  -4.618106 -0.39458 0.942401
C  -4.045585 0.651399 -1.201765
C  -5.016267 0.223076 -0.266753
H  -0.65242 -0.678838 1.627544
H  -0.941694 -2.579943 0.01362
H  -0.394795 -1.512529 -1.333982
H  2.307152 2.380934 -0.022703
H  -2.939049 -1.056299 2.145203
H  -1.936275 0.820688 -1.641348
H  3.611943 -2.476441 -0.088172
H  -5.367622 -0.720361 1.675422
H  -4.378247 1.139841 -2.12221
H  5.834031 1.531233 -0.273641
H  5.933496 -1.58379 -0.215171
H  -6.963493 0.141189 0.120621
