program: Gaussian 09
title: 000125099
version: EM64L-G09RevD.01
frameworkgroup: C1[X(C15H18N4O4)]
method: RPBEPBE
basis: SDD
operation: Freq
keyword: #p
keyword: freq=noraman
keyword: PBEPBE/SDD
title: #p freq=noraman PBEPBE/SDD
converged: NO YES NO NO
title: Mulliken charges:
elementType: O O O O N N N N C C C C C C C C C C C C C C C H H H H H H H H H H H H H H H H H H
charge: -0.171350 -0.253584 -0.342581 -0.211741 -0.165888 -0.190574 -0.196702 -0.090870 -0.029925 0.190650 0.249751 0.284561 -0.355072 0.275650 -0.329298 -0.534332 -0.674753 0.490570 -0.695912 0.030989 -0.454683 -0.604917 -0.814950 0.222334 0.281769 0.252311 0.258617 0.242604 0.240106 0.318711 0.271309 0.221906 0.215892 0.237669 0.250660 0.258059 0.258570 0.225254 0.228086 0.238616 0.372492
chargesum: 0.00000
title: Mulliken charges with hydrogens summed into heavy atoms:
elementType: O O O O N N N N C C C C C C C C C C C C C C C
charge: -0.171350 -0.253584 0.029910 -0.211741 -0.165888 -0.190574 -0.196702 -0.090870 -0.029925 0.190650 0.249751 0.284561 0.149031 0.275650 -0.076987 -0.275714 0.126669 0.490570 0.013195 0.030989 -0.217014 0.162371 -0.122994
polarizability: 3.54632489e+02 -1.54287988e+01 2.19010432e+02 7.65361172e+00 5.47253277e-01 1.25649361e+02
1716.lowfreq: -48.3200 -2.0829 -0.0006 -0.0005 -0.0001 6.6677 13.2506 24.8173 40.1142
frequency: -48.3100 24.7454 40.1113 49.0979 77.9656 81.6213 92.1629 123.6792 127.3571 158.8454 161.1682 171.1729 187.9800 201.7883 210.7461 236.7995 256.2024 258.9394 281.3169 296.4933 308.7312 332.0131 337.2968 342.0919 353.4183 371.9380 379.1376 399.9602 406.5522 422.6999 465.6083 494.3497 511.7179 523.6823 551.4680 586.1951 606.5393 626.5863 657.1495 660.0098 709.2004 714.6419 731.2703 744.6386 762.1785 769.6733 797.0743 809.7830 831.7612 866.7438 888.4532 923.8838 941.2880 949.6597 981.7245 1012.9392 1028.1115 1046.6969 1061.2639 1074.9027 1091.3877 1106.3635 1122.1629 1124.2269 1137.7711 1175.2970 1190.7228 1211.2122 1236.2529 1244.5690 1263.8741 1270.0818 1302.2283 1320.1877 1328.4839 1350.0531 1373.3107 1388.0760 1388.5060 1394.9857 1400.2396 1419.3146 1424.1613 1443.9893 1462.1416 1465.2240 1473.4033 1474.5676 1483.6390 1484.0507 1488.3141 1496.7746 1500.8230 1517.2206 1547.0825 1589.2716 1595.5118 1628.4806 1631.3831 2975.2981 2994.5212 2995.7026 3009.9103 3016.6864 3056.2189 3082.6997 3085.6860 3086.3491 3113.1996 3116.2269 3131.1506 3136.9952 3140.7375 3149.5596 3164.3332 3194.4598 3440.1646
redmass: 1.0797 1.0195 3.9522 5.9429 3.7060 4.0646 4.7336 7.2053 4.3630 5.2213 2.3734 3.1921 1.2394 5.1091 3.3710 1.3649 3.2262 4.2111 5.6067 3.9450 4.1684 2.0823 4.7097 2.7024 3.0222 3.4142 3.3585 6.3472 5.7498 4.3027 3.2494 5.3133 6.6166 6.2778 5.5783 3.6321 7.6341 5.2260 6.3318 9.9927 6.5892 10.2526 3.7359 3.4259 4.7989 6.4642 2.0433 1.3814 4.1645 1.4241 3.6341 3.8476 1.3525 3.0075 2.4713 1.6872 2.9528 1.5362 4.8989 3.2036 1.9780 3.0139 1.3153 1.3850 1.8437 1.5499 2.0523 2.3215 2.6410 1.2641 2.2822 2.0435 1.7955 3.1006 5.6261 1.5351 1.9889 1.5997 2.5979 3.1652 1.2441 1.2778 1.4210 2.1818 1.0728 1.0454 1.0806 1.1101 1.2069 1.3218 1.0713 1.0890 1.0483 2.8309 7.1397 7.7015 8.5862 7.6928 8.1522 1.0389 1.0377 1.0343 1.0713 1.0347 1.0950 1.0988 1.0996 1.1025 1.0990 1.0969 1.1001 1.0906 1.0936 1.1034 1.0905 1.0924 1.0686
irintensity: 0.4199 0.7304 0.0901 0.2996 2.9426 1.7594 7.6430 0.6640 0.4494 0.9297 0.9739 1.7947 0.2129 2.1396 8.1692 2.8107 65.6247 1.6102 13.5341 3.9891 0.4440 50.2535 5.0334 37.8204 16.0418 2.6058 3.0879 27.7850 0.3191 12.1342 5.1844 2.9807 0.5342 5.1249 9.3979 7.3183 1.9399 1.7840 8.0725 3.2855 11.7395 10.8531 0.9369 5.1668 5.7586 6.8094 60.5059 47.4442 36.0916 10.7898 0.4056 4.0226 1.1050 25.7304 30.2156 33.3440 17.7413 22.0642 7.2546 56.8046 13.7174 60.9751 0.0308 9.0405 10.3293 16.4861 17.5992 8.6754 116.7596 63.8131 66.4267 47.8212 35.3991 27.4174 62.0880 42.5761 17.7858 81.2232 63.5564 6.1804 13.3136 76.3633 45.5272 1.5732 14.2872 7.8099 12.3529 5.5372 32.5388 26.2587 13.0671 29.2048 20.8832 79.4901 647.7813 345.6075 483.6194 40.0215 3.8058 48.5664 27.9695 36.2331 36.4911 24.6933 20.6588 32.2800 16.2570 16.3851 12.3317 9.7728 1.5936 15.8274 2.9892 1.2428 7.4054 6.6398 29.7578
temp: 298.150 k
press: 1.00000 atm
elementType: 8 8 8 8 7 7 7 7 6 6 6 6 6 6 6 6 6 6 6 6 6 6 6 1 1 1 1 1 1 1 1 1 1 1 1 1 1 1 1 1 1
symmnumber: 1
zpe: 834134.9 jmol-1
zpe.correction: 0.317705 hartree
zpe.thermalcorrener: 0.339601 hartree
zpe.thermalcorrenthalpy: 0.340545 hartree
zpe.thermalcorrgfe: 0.267387 hartree
zpe.sumelectzpe: -1100.540991 hartree
zpe.sumelectthermal: -1100.519096 hartree
zpe.sumelectthermalent: -1100.518151 hartree
zpe.sumelectthermalfe: -1100.591310 hartree
dipole: -6.4762 0.0119 -0.8156
dipole: 6.5274
quadrupole: -131.7056 -132.4534 -137.5155
quadrupole: 10.7139 -1.5703 -0.8793
quadrupole: 2.1859 1.4381 -3.6240 10.7139 -1.5703 -0.8793
hfenergy: -1100.8586965 hartree
pointgroup: C01 [X(C15H18N4O4)]
dipole: 2.5314524 0.0524299 -0.4290162 debye
polarizability: 352.4448233|-13.3927955|209.7556591|-22.3936317|29.5021073|137.0917995 unknown
InChI: InChI=1S/C15H18N4O4/c1-5-19-10-7-6-9(2)8-11(10)17(3)12-15(19,23-22)13(20)18(4)14(21)16-12/h6-8,22H,5H2,1-4H3
charge 0 multiplicity 1
41 atoms
O  -0.977829 -0.819299 1.57442
O  -2.435096 -1.64587 -1.294572
O  -2.255239 -0.356194 2.261423
O  -3.912726 2.338259 0.604043
N  0.264163 -1.089033 -0.395731
N  0.689977 1.662705 0.197156
N  -3.179286 0.38274 -0.44192
N  -1.607719 2.01727 0.421792
C  -0.840819 -0.307748 0.059223
C  -0.602066 1.179917 0.185489
C  1.582853 -0.566008 -0.331819
C  1.806162 0.815012 -0.036427
C  0.10225 -2.572023 -0.566445
C  -2.204782 -0.592573 -0.636458
C  2.721063 -1.379368 -0.570522
C  3.123206 1.331055 0.014166
C  0.9015 3.106187 0.450972
C  4.25138 0.516413 -0.225573
C  0.228713 -3.037847 -2.029228
C  -2.937518 1.623378 0.256996
C  4.024216 -0.850522 -0.514525
C  -4.5710 0.099623 -0.860614
C  5.65356 1.097253 -0.198007
H  0.851087 -3.06297 0.083032
H  -0.887067 -2.845826 -0.180949
H  2.60024 -2.438588 -0.8004
H  3.281378 2.387557 0.246017
H  1.415788 3.571695 -0.407393
H  1.505171 3.247458 1.364359
H  -0.088524 3.562589 0.586819
H  -0.616473 -2.645666 -2.61546
H  1.171879 -2.709803 -2.499463
H  0.191983 -4.142412 -2.066993
H  4.875606 -1.514902 -0.700261
H  -5.01879 1.01706 -1.269967
H  -5.166378 -0.223337 0.010388
H  -4.548231 -0.701664 -1.612695
H  5.73272 1.93863 0.512918
H  6.398428 0.336312 0.093179
H  5.948318 1.480219 -1.194523
H  -1.928501 0.438422 2.777553
