program: Gaussian 09
title: 000125094
version: EM64L-G09RevD.01
frameworkgroup: C1[X(C5H12O4)]
method: RPBEPBE
basis: SDD
operation: Freq
keyword: #pfreq=noraman
keyword: PBEPBE/SDD
title: #p freq=noraman PBEPBE/SDD
converged: YES YES NO NO
title: Mulliken charges:
elementType: O O O O C C C C C H H H H H H H H H H H H
charge: -0.492972 -0.488614 -0.429989 -0.481967 0.183529 -0.030194 -0.344850 -0.759884 -0.389561 0.248830 0.248255 0.177146 0.273013 0.201311 0.221408 0.204133 0.236019 0.348900 0.372533 0.346255 0.356700
chargesum: 0.00000
title: Mulliken charges with hydrogens summed into heavy atoms:
elementType: O O O O C C C C C
charge: -0.144072 -0.116081 -0.083734 -0.125267 0.183529 0.218637 0.080550 -0.064151 0.050591
polarizability: 7.60190616e+01 2.15502166e+00 6.48581629e+01 1.20591307e+00 -6.00829555e-01 6.55852314e+01
1716.lowfreq: -12.0712 -3.9385 0.0005 0.0008 0.0008 11.7804 63.1873 85.2469 134.1848
frequency: 62.9577 85.2256 134.1837 173.7882 192.3025 229.9294 240.3848 258.0128 293.5726 300.8956 329.1631 348.8592 431.0652 472.8441 487.1656 509.7615 548.0905 601.9684 749.8207 845.0074 885.0961 919.2978 953.9653 985.8177 997.7830 1039.5086 1057.4501 1085.5738 1102.1798 1164.9286 1173.8139 1186.9317 1219.0320 1254.1474 1288.1917 1330.9050 1351.9776 1381.2643 1383.9034 1392.7641 1412.1820 1459.4822 1463.4112 1465.8703 1482.7018 2930.9641 2972.9391 2980.4325 2989.6280 3059.2957 3070.9400 3091.3027 3102.8021 3481.1057 3531.7950 3562.0154 3599.2236
redmass: 3.2413 4.7296 4.4759 3.1558 1.1395 1.7553 1.6342 3.4067 1.4884 1.6904 3.8413 3.2142 2.1904 1.3981 2.8972 2.7931 1.2592 3.2660 3.8008 2.7684 2.0758 2.1480 4.4126 1.5429 4.4447 2.3029 1.9336 1.5152 2.1787 1.2531 1.5191 1.2818 1.4472 1.3159 1.2846 1.2693 1.3378 1.4985 1.3090 1.2380 1.7733 1.0687 1.0712 1.0783 1.0878 1.0706 1.0623 1.0394 1.0791 1.1037 1.0970 1.0928 1.0980 1.0644 1.0650 1.0660 1.0669
irintensity: 3.8626 5.8756 12.0643 11.8390 0.7464 51.9083 106.2820 5.6526 24.0546 44.6790 1.6904 7.4544 13.7326 162.5806 12.3756 51.8776 171.7292 38.9711 35.2487 38.7621 2.5172 18.7947 58.7033 6.5289 85.9813 125.9164 16.0982 21.1233 10.5493 62.5887 29.2424 5.9303 14.5259 64.9807 7.8090 23.2342 14.1531 21.3273 1.8626 44.4169 9.3687 3.9346 0.8107 18.8096 12.7615 80.3188 20.7696 43.0727 34.8030 36.0875 33.9029 9.4208 11.7094 11.7530 26.9073 6.0371 6.4189
temp: 298.150 k
press: 1.00000 atm
elementType: 8 8 8 8 6 6 6 6 6 1 1 1 1 1 1 1 1 1 1 1 1
symmnumber: 1
zpe: 455212.7 jmol-1
zpe.correction: 0.173381 hartree
zpe.thermalcorrener: 0.184712 hartree
zpe.thermalcorrenthalpy: 0.185656 hartree
zpe.thermalcorrgfe: 0.137271 hartree
zpe.sumelectzpe: -497.826253 hartree
zpe.sumelectthermal: -497.814922 hartree
zpe.sumelectthermalent: -497.813977 hartree
zpe.sumelectthermalfe: -497.862363 hartree
dipole: -1.2983 4.1189 -1.6059
dipole: 4.6075
quadrupole: -46.5820 -58.0687 -55.3203
quadrupole: 4.8922 1.0104 -1.1557
quadrupole: 6.7417 -4.7451 -1.9966 4.8922 1.0104 -1.1557
hfenergy: -497.9996339 hartree
pointgroup: C01 [X(C5H12O4)]
dipole: -0.5948961 1.7048878 -0.1597384 debye
dipolederiv: -0.4660892 0.2019522 0.1221363 0.1866552 -0.5151239 0.1728764 0.1143792 0.1507268 -0.7320552 -0.4369824 0.0717322 0.1308609 0.0803505 -0.5840668 0.1762672 0.1163845 0.1626463 -0.6699889 -0.6764726 0.1128553 0.1073995 0.0607522 -0.4513506 -0.2647133 0.083439 -0.2727885 -0.5299476 -0.7392623 -0.2768903 0.0463748 -0.3248431 -0.4071856 -0.1161634 0.0547531 -0.1075507 -0.5342135 0.2982863 -0.016742 -0.0461045 0.0049467 0.3833107 -0.1421923 -0.1233351 -0.1227482 0.5003456 0.2344465 -0.018336 -0.0878402 0.0938838 0.2938322 -0.1015935 -0.137125 -0.0860518 0.4526385 0.2956259 0.0464757 -0.0612303 0.0246912 0.2880104 0.2090255 0.0372999 0.1787356 0.3752432 0.0092833 0.0271083 0.0297436 -0.005646 -0.115624 -0.1219698 0.0313031 -0.0198253 -0.157097 0.4985573 0.2647899 -0.0741561 0.2055731 0.283355 0.1248495 -0.0057703 0.1041489 0.2572381 0.0898361 -0.004873 0.0121338 0.003693 -0.0609076 -0.0774579 -0.0045678 -0.0530009 -0.0791325 0.1359089 -0.0146673 0.0232028 -0.0051362 0.0226269 0.0803318 0.0043068 0.0367488 -0.0477682 -0.1662353 -0.1089022 -0.0524383 -0.149234 -0.0919528 -0.0987285 -0.0133954 -0.0538632 0.0055067 0.131876 0.0057424 0.0269531 0.0212701 0.1079468 0.074952 0.0216231 0.0418184 -0.0380561 -0.1382363 -0.1393396 -0.0093944 -0.0920299 0.0266223 -0.0215808 0.0264401 0.0067234 0.0851291 -0.0292305 0.1435967 -0.0256542 0.127171 -0.0284978 -0.0076358 -0.0341006 0.0309194 0.0739568 0.0012906 -0.0027579 0.0245351 -0.0272568 -0.1537634 -0.090368 0.0360298 -0.1364156 -0.0088207 0.0577348 -0.0317686 -0.0028979 -0.0535493 0.0273447 0.0413918 0.0191766 0.0796568 -0.1263058 0.1650457 -0.1740811 -0.0334701 -0.1496237 0.1943544 -0.0235545 -0.0829066 -0.0632811 0.2972089 0.2000746 -0.1170009 0.0026421 -0.1144981 0.348074 -0.0510333 -0.016765 -0.0545458 0.3238875 0.4009467 -0.0562495 -0.0727913 -0.0305771 0.2248946 0.146972 -0.0524002 0.094383 0.1989373 0.1335962 0.0873558 -0.060005 0.1434074 0.2081006 0.0903248 -0.074769 0.0835638 0.3532938 unknown
polarizability: 76.0706863|2.1555857|65.3539666|0.8362525|-0.8131609|65.0378031 unknown
InChI: InChI=1S/C5H12O4/c1-5(9,3-7)4(8)2-6/h4,6-9H,2-3H2,1H3
charge 0 multiplicity 1
21 atoms
O  0.769486 1.107831 -1.292226
O  -0.826184 -0.755376 1.464102
O  2.03452 -1.293153 -0.863022
O  -2.972243 -0.493658 -0.188569
C  0.676146 0.548814 0.097393
C  -0.629549 -0.280078 0.08704
C  1.892715 -0.397467 0.283264
C  0.678366 1.671906 1.142598
C  -1.873895 0.482252 -0.381146
H  -0.479923 -1.146841 -0.590245
H  1.740909 -1.039201 1.165683
H  2.811877 0.215205 0.424449
H  0.491402 1.247071 2.142915
H  1.655814 2.192475 1.158776
H  -0.109227 2.417832 0.935283
H  -2.050383 1.381724 0.243109
H  -1.765671 0.770467 -1.442334
H  1.399804 1.872676 -1.278658
H  -1.722315 -1.183981 1.477898
H  1.870002 -0.730997 -1.668866
H  -3.837653 -0.0858 -0.435144
