program: Gaussian 09
title: 000125088
version: EM64L-G09RevD.01
frameworkgroup: C1[X(C11H8N3O2)]
method: RPBEPBE
basis: SDD
operation: Freq
keyword: #p
keyword: freq=noraman
keyword: PBEPBE/SDD
title: #p freq=noraman PBEPBE/SDD
converged: YES YES NO NO
title: Mulliken charges:
elementType: O O N N N C C C C C C C C C C C H H H H H H H H
charge: -0.416226 -0.235402 -0.223697 0.033192 0.024036 0.299129 0.296722 0.119534 -0.042577 -0.299488 -0.343991 -0.252266 -0.295350 -0.196102 -0.172274 0.167096 0.341748 0.322668 0.283404 0.317878 0.285658 0.281133 0.282465 0.422711
chargesum: 1.00000
title: Mulliken charges with hydrogens summed into heavy atoms:
elementType: O O N N N C C C C C C C C C C C
charge: 0.006485 -0.235402 0.058768 0.033192 0.024036 0.299129 0.296722 0.119534 -0.042577 0.042260 -0.021324 0.031138 0.022529 0.089556 0.108860 0.167096
polarizability: 2.39264842e+02 9.08900346e+00 1.66530793e+02 1.31073604e-01 3.53984876e-02 5.31687707e+01
1716.lowfreq: -7.6469 -0.0008 -0.0002 0.0006 3.1953 8.4367 19.5404 24.6487 39.6567
frequency: 19.4006 24.6468 39.6530 63.4596 95.2962 107.5262 130.6421 139.3829 183.7850 206.2216 213.7701 314.2392 337.2250 366.4865 398.1095 444.8417 454.6844 481.6975 516.5710 542.0337 578.0249 603.7131 639.9139 653.9697 721.1590 749.4547 772.3193 819.7743 821.7581 863.6667 877.1948 954.0723 991.4122 1005.3575 1033.5501 1035.6547 1036.6443 1049.4386 1081.7839 1102.1602 1170.7031 1190.3250 1194.5786 1204.8382 1272.0446 1324.2473 1352.2260 1389.7953 1403.9608 1424.9944 1462.4336 1493.0428 1521.7276 1545.2439 1574.5405 1597.5405 1628.0968 2193.9874 3131.2638 3151.2037 3165.1975 3180.3011 3180.8639 3197.6609 3275.0855 3525.2348
redmass: 9.0720 8.5177 10.6133 6.1308 12.4623 13.1782 11.2602 4.2796 4.0575 6.7324 4.5289 6.2353 8.0592 2.9130 6.9095 3.0911 3.4719 6.6900 5.3953 5.3448 6.4121 1.8075 4.6815 1.8216 2.4127 3.2035 5.5046 1.4552 6.0951 2.0604 5.9885 1.1467 1.3857 1.3660 1.5103 1.4441 3.7936 2.6364 1.8752 1.9386 1.7666 1.1243 1.4385 1.5489 1.7761 2.1015 2.2273 2.5365 2.7595 3.2615 4.1358 3.9543 5.4970 4.4015 5.9542 6.4840 8.6693 13.9987 1.0945 1.0911 1.0902 1.0985 1.0958 1.0964 1.0779 1.0649
irintensity: 0.4560 0.6612 3.9024 1.3240 4.5323 3.0511 0.8116 2.9232 1.2304 2.6061 4.4450 0.9563 4.0493 16.4443 4.4072 4.2343 0.6450 11.0270 2.7687 18.2881 25.6428 75.9037 44.4526 89.7083 30.7118 13.1071 2.9218 40.3067 2.6415 0.7879 1.4871 117.7905 1.7412 13.8180 0.0626 2.4435 247.8904 50.3084 131.9469 77.2713 0.4293 69.3703 11.1860 7.3900 78.5782 78.8124 9.9168 14.6309 57.1821 46.4566 50.3210 86.6912 52.0038 35.5067 168.3274 64.0649 134.1848 6.5200 36.2015 1.5634 1.4956 1.7001 3.5907 2.7855 433.1473 147.7897
temp: 298.150 k
press: 1.00000 atm
elementType: 8 8 7 7 7 6 6 6 6 6 6 6 6 6 6 6 1 1 1 1 1 1 1 1
symmnumber: 1
zpe: 443945.1 jmol-1
zpe.correction: 0.169090 hartree
zpe.thermalcorrener: 0.184065 hartree
zpe.thermalcorrenthalpy: 0.185010 hartree
zpe.thermalcorrgfe: 0.123797 hartree
zpe.sumelectzpe: -737.290223 hartree
zpe.sumelectthermal: -737.275248 hartree
zpe.sumelectthermalent: -737.274304 hartree
zpe.sumelectthermalfe: -737.335517 hartree
dipole: -0.6500 -0.1673 -0.0142
dipole: 0.6713
quadrupole: -36.0435 -69.8425 -89.8630
quadrupole: 10.2909 0.0419 0.0435
quadrupole: 29.2062 -4.5929 -24.6133 10.2909 0.0419 0.0435
hfenergy: -737.4593132 hartree
pointgroup: C01 [X(C11H8N3O2)]
dipole: -0.2564621 0.0585238 -0.0237556 debye
dipolederiv: -1.3990244 0.2217844 -0.1148112 0.2180449 -0.3395889 0.0213593 -0.1154611 0.0212766 -0.4180826 -0.7645158 -0.1359568 -0.0446607 -0.0171521 -0.8378994 0.0180144 -0.0490349 0.0047716 -0.3072557 -0.4601024 0.0080951 -0.0096528 -0.0687436 -0.0328389 -0.0179323 -0.0077699 -0.0095796 -0.3760483 -0.3408233 0.0345758 -0.0400491 0.1085237 0.0084339 0.0119838 -0.0425938 0.0040261 0.0079607 0.0890423 -0.0194064 0.0062859 -0.0124153 0.0333725 -0.0011529 0.0054679 -0.001907 0.04216 -0.1887847 0.136849 -0.0227914 0.6229118 -0.8620301 0.0933858 -0.038794 0.0425731 -0.0227638 -0.1993075 0.2520834 -0.0358607 -0.4736139 0.1445909 -0.0524944 -0.0116896 0.0239462 0.0625921 -0.0171743 -0.4165301 0.0038913 -0.1981822 0.1789768 -0.0240023 -0.0030735 -0.0470516 0.0746 0.0812417 -0.1672511 0.0009364 -0.3311479 -0.0962087 -0.0279157 0.0046765 -0.0110305 0.1297483 0.9398688 -0.1732985 0.0940679 -0.6784243 0.5533005 -0.0862865 0.1107227 -0.0331948 0.1160428 -0.4906879 0.2787816 -0.0558299 0.5616374 -0.0359128 0.0587124 -0.0644445 0.0286073 -0.0611657 0.5210337 -0.0697861 0.048556 0.5507592 -0.0279654 0.0616671 0.0288363 -0.0036388 0.083174 0.1413484 -0.2670637 0.0299109 -0.1209147 -0.5268409 0.0025095 0.0256818 -0.0128784 -0.056272 -1.1408207 0.0785086 -0.1086017 -0.3504398 0.2989078 -0.0513661 -0.0945454 -0.006575 -0.1466537 0.4032733 0.0640178 0.0449259 -0.0512398 0.4338894 -0.0211065 0.0480763 -0.0089785 -0.0349146 1.9253637 0.1048902 0.1756128 0.1533804 1.1522865 -0.0169877 0.1738168 -0.0211927 0.2755182 0.2661371 -0.0018635 0.0133854 0.0194786 0.1629105 0.00119 0.0131933 -0.0006563 0.1398066 0.0775161 -0.0489693 -0.0064725 0.0064502 0.1221415 0.001788 -0.0080615 -0.004155 0.1550722 0.0596787 0.0243585 -0.010226 -0.0003174 0.1022933 0.0015985 -0.0093771 0.004291 0.1489743 0.0936665 0.014554 -0.0077895 0.0263616 0.1382363 0.0036051 -0.008109 0.0025678 0.1626587 0.0881531 0.0143841 -0.0078677 0.0243712 0.0267633 0.0068924 -0.0083044 0.0059496 0.1571603 0.106742 0.0203825 -0.0050274 0.0058192 0.0279732 0.0046186 -0.0047704 0.0062737 0.1475086 0.7218214 0.0747968 0.0444346 0.0692873 0.1933442 0.0100817 0.0460586 0.0107297 0.2951641 0.486354 -0.0279366 0.0076331 -0.0644344 0.1818645 0.0018379 0.0094987 0.0058258 0.4250156 unknown
polarizability: 237.6029377|-6.5250519|165.940821|19.8074519|-4.4475536|55.420647 unknown
InChI: InChI=1S/C11H8NO2.N2/c12-10-6-2-3-7-8(10)4-1-5-9(7)11(13)14;1-2/h1-6,12-13H;
charge 1 multiplicity 1
24 atoms
O  4.550268 0.203282 0.51095
O  3.235074 2.097554 0.300995
N  -2.569455 -1.244654 -0.198142
N  -5.473475 -0.040522 -0.555838
N  -6.593428 0.141191 -0.68732
C  0.818386 0.282684 0.111052
C  -0.220208 -0.724808 0.035518
C  2.199687 -0.139911 0.270491
C  -1.641025 -0.301027 -0.128689
C  0.436852 1.656452 0.025729
C  0.105371 -2.09298 0.11547
C  -1.943674 1.138824 -0.207146
C  2.490356 -1.515151 0.346749
C  -0.924481 2.076131 -0.131169
C  1.454786 -2.48338 0.269997
C  3.335213 0.848835 0.357008
H  1.229079 2.41323 0.083496
H  -0.699894 -2.830553 0.055728
H  -2.99004 1.444042 -0.327214
H  3.529434 -1.829408 0.466766
H  -1.142075 3.146388 -0.189819
H  1.708488 -3.546258 0.332003
H  -3.542812 -0.878283 -0.314237
H  5.296471 0.860125 0.567321
