program: Gaussian 09
title: 000125073
version: EM64L-G09RevD.01
frameworkgroup: C1[X(C7H11NO7)]
method: RPBEPBE
basis: SDD
operation: Freq
keyword: #p
keyword: freq=noraman
keyword: PBEPBE/SDD
title: #p freq=noraman PBEPBE/SDD
converged: YES YES NO NO
title: Mulliken charges:
elementType: O O O O O O O N C C C C C C C H H H H H H H H H H H
charge: -0.490871 -0.414330 -0.498228 -0.391405 -0.179433 -0.242926 -0.261721 -0.343013 -0.146020 -0.110279 -0.122879 -0.229241 -0.077366 0.176680 -0.049841 0.261669 0.281348 0.310592 0.277125 0.349458 0.193744 0.396763 0.345360 0.387360 0.177807 0.399649
chargesum: 0.00000
title: Mulliken charges with hydrogens summed into heavy atoms:
elementType: O O O O O O O N C C C C C C C
charge: -0.094108 -0.068970 -0.110867 0.008244 -0.179433 -0.242926 -0.261721 0.006444 0.115649 0.171069 0.187712 0.047884 0.116378 0.176680 0.127966
polarizability: 1.15879566e+02 -8.29821246e+00 1.14215639e+02 2.25416791e+00 -1.78061568e+00 8.30102531e+01
1716.lowfreq: -4.7010 -0.0008 0.0004 0.0005 4.1156 6.4492 25.9340 36.4835 43.1601
frequency: 25.8572 36.4253 43.1133 70.4960 75.5978 87.9020 110.9418 144.0880 174.6025 189.0102 200.4617 209.3290 264.0876 281.2999 290.6699 378.5675 408.0718 439.0775 452.8530 459.2105 474.4784 528.6726 559.6065 592.9391 606.5435 619.4472 638.1086 687.8553 749.9307 781.9650 825.6345 834.0647 914.6840 924.1127 962.3482 989.4663 1011.3254 1032.5486 1047.7951 1077.1045 1085.5274 1107.8217 1165.1186 1180.2171 1222.5507 1228.0485 1261.5320 1269.8690 1290.5154 1303.1466 1315.4866 1352.1174 1357.8492 1360.2708 1373.5594 1378.6468 1382.5002 1458.4635 1627.8504 1641.3606 1644.0906 2907.4001 2951.8946 2973.0743 3007.5863 3014.4957 3078.0013 3467.5114 3521.4437 3525.5599 3526.6465 3528.6322
redmass: 9.4726 7.1532 8.3257 7.5247 7.3500 6.0633 4.2310 6.2099 4.1555 6.7502 7.6513 5.0768 5.9723 3.3579 3.9224 1.9320 1.8604 4.5093 1.5069 3.0889 2.9645 2.4050 1.1994 4.3169 3.3930 2.9068 2.3530 1.1341 4.9696 4.0597 4.6060 2.6497 2.8645 3.1051 1.5945 4.7177 3.3497 3.3295 2.9797 2.2497 3.4348 2.4457 1.4579 1.2303 1.2984 1.7601 1.2404 1.3247 1.5506 1.4713 1.3064 1.3077 1.2172 1.2459 1.2757 1.4209 1.9491 1.8544 6.1389 9.2918 9.3135 1.0879 1.0874 1.0808 1.0843 1.0830 1.0869 1.0653 1.0784 1.0645 1.0657 1.0658
irintensity: 1.9706 0.8061 5.2664 7.5029 3.8831 2.9006 7.1435 2.7630 17.1402 8.6652 5.0026 26.0395 2.8779 26.7603 30.3873 30.4495 151.7662 53.2704 33.8279 25.2135 10.5766 37.1357 289.9044 5.0168 31.8644 60.8523 73.6052 125.8093 18.9448 15.4830 20.9709 20.6993 53.7690 20.2630 2.1277 48.5729 37.4738 45.2658 220.0798 26.7507 55.3614 12.8912 17.6373 42.7140 27.8242 32.9013 19.4494 59.1099 89.5860 11.8348 10.9779 9.9253 19.8660 4.3324 23.7032 13.8161 31.9182 173.6458 274.1065 87.4720 286.1727 96.4803 105.3566 9.8138 11.5195 15.5653 8.9816 66.1966 60.2691 49.1310 23.7560 27.6251
temp: 298.150 k
press: 1.00000 atm
elementType: 8 8 8 8 8 8 8 7 6 6 6 6 6 6 6 1 1 1 1 1 1 1 1 1 1 1
symmnumber: 1
zpe: 500691.5 jmol-1
zpe.correction: 0.190703 hartree
zpe.thermalcorrener: 0.207115 hartree
zpe.thermalcorrenthalpy: 0.208059 hartree
zpe.thermalcorrgfe: 0.144831 hartree
zpe.sumelectzpe: -853.462370 hartree
zpe.sumelectthermal: -853.445959 hartree
zpe.sumelectthermalent: -853.445014 hartree
zpe.sumelectthermalfe: -853.508242 hartree
dipole: 3.5804 0.6220 -3.5455
dipole: 5.0771
quadrupole: -90.0449 -95.0653 -87.2574
quadrupole: 5.9415 7.6203 -5.3312
quadrupole: 0.7443 -4.2761 3.5318 5.9415 7.6203 -5.3312
hfenergy: -853.6530732 hartree
pointgroup: C01 [X(C7H11N1O7)]
dipole: -1.4079656 0.1952168 -1.4033922 debye
dipolederiv: -0.6650585 -0.1129184 -0.0522553 -0.1057019 -0.5506329 0.2310661 -0.0778204 0.2368012 -0.6447144 -0.6971153 -0.0663359 0.0482669 -0.0342023 -0.1319885 0.057442 -0.0119266 0.0715522 -0.7221165 -0.4881026 0.0690798 -0.0538495 0.1423239 -0.7165781 0.0019292 -0.0351648 0.02352 -0.4996922 -0.3286193 -0.1205284 -0.0954911 -0.1395787 -1.1699072 -0.185847 -0.07551 -0.1574427 -0.3884244 -0.4938522 -0.0574002 -0.0260931 -0.1282688 -0.7973305 -0.2969523 -0.1034907 -0.2652438 -0.4577941 -0.8899069 0.24744 0.1577102 -0.0104501 -0.7268733 -0.0843668 0.2471843 -0.167681 -0.3734068 -0.4598865 0.2121791 -0.0177796 0.2485649 -0.8747676 0.0505636 -0.2152356 0.4768848 -0.623972 -0.7452059 0.2336525 0.0020578 0.3345587 -1.0750095 -0.0460608 0.0114392 -0.0875749 -0.2902286 0.3923661 -0.0287138 0.046367 -0.0497301 0.3258357 -0.1702893 -0.0414458 -0.2708128 0.4032873 0.4226605 0.0044849 -0.0069737 -0.0937784 0.101902 0.0214205 0.0332295 0.0529744 0.4904652 -0.0718045 -0.212918 -0.1474129 -0.1755491 -0.0076734 0.001995 -0.0707126 0.1826476 0.2793203 -0.2424046 -0.2011576 -0.0010211 -0.1026866 0.4392732 0.0664592 0.1259098 0.0937599 0.199838 0.8147822 0.2705898 0.0808379 0.2364235 0.8505336 0.4287767 0.1081925 0.3275868 0.3188683 1.2091579 -0.0805986 -0.2065053 0.2121688 1.3768005 0.2718748 -0.3654263 0.2847667 0.349751 0.3798533 -0.5087626 0.0303528 -0.6673404 1.5320267 -0.0790161 0.1427632 -0.3529691 0.7850865 0.0728743 0.0307179 0.0523247 0.0421478 -0.0158778 -0.0511426 0.0468699 -0.0208554 -0.0696683 0.0845398 0.0247917 0.0073041 0.0191748 -0.0423061 -0.0427022 -0.0069618 -0.0204441 0.0120865 0.1419086 -0.0296904 -0.0186477 -0.0400094 0.12225 0.0807543 -0.0144458 -0.0484045 0.0307274 0.1214451 0.0194368 0.014478 0.0124031 0.0018553 -0.0141363 -0.0100283 -0.0660792 -0.0702318 0.3996121 0.0005575 -0.020566 -0.0034867 0.2084788 -0.0082215 -0.0032401 -0.0380752 0.1627009 -0.2326072 0.0368228 0.0427524 0.0668455 0.0112801 -0.0654456 0.1090278 -0.0319786 0.0630767 0.3680106 0.1408123 0.0100793 0.1494937 0.3039268 -0.0623132 0.000055 -0.07427 0.2785024 0.3860107 0.020119 0.0134684 0.0346455 0.0288042 -0.0635919 0.0194032 0.0058396 0.3297545 0.229206 0.0914313 0.0288215 -0.0344073 0.4156168 -0.0018134 0.0171279 -0.0486384 0.3287149 0.1213552 0.0336661 0.0210462 0.0510364 0.031365 -0.0336149 0.0601619 -0.1145395 -0.2486647 0.1707811 -0.0167576 0.0907281 0.0354032 0.3589965 -0.0067673 0.1100445 0.008676 0.356734 unknown
polarizability: 114.4925819|-7.7459127|113.2064353|-3.5408769|8.7928971|85.4064403 unknown
InChI: InChI=1S/C7H11NO7/c9-1-3(8-2-10)4(11)5(12)6(13)7(14)15/h1-6,8,11-14H
charge 0 multiplicity 1
26 atoms
O  0.566929 1.419696 -1.276536
O  -1.028249 -0.24313 1.673711
O  -2.007511 1.913385 -0.254684
O  -3.243261 -1.537727 -0.447411
O  2.877665 1.974078 1.272837
O  -4.207136 0.435041 0.334743
O  2.904923 -2.66457 -0.015669
N  2.150951 -0.705265 -1.044324
C  0.527442 0.794872 0.057756
C  -0.726788 -0.107287 0.246551
C  1.841494 0.00712 0.199275
C  -1.923778 0.478964 -0.541085
C  3.013678 0.92074 0.613296
C  -3.239552 -0.188782 -0.161032
C  2.656232 -1.991087 -1.054806
H  0.513885 1.583649 0.83622
H  -0.54913 -1.138241 -0.100794
H  1.740061 -0.752746 1.004514
H  -1.748161 0.326494 -1.622912
H  1.946795 -0.201872 -1.913092
H  4.016339 0.551833 0.283808
H  -0.104596 2.151892 -1.280399
H  -1.188832 0.663589 2.046758
H  -2.943296 2.127964 0.014309
H  2.820047 -2.376853 -2.085791
H  -4.09685 -1.95866 -0.156941
