program: Gaussian 09
title: 000125060
version: EM64L-G09RevD.01
frameworkgroup: C1[X(C19H22N2O3)]
method: RPBEPBE
basis: SDD
operation: Freq
keyword: #p
keyword: freq=noraman
keyword: PBEPBE/SDD
title: #p freq=noraman PBEPBE/SDD
converged: NO YES NO NO
title: Mulliken charges:
elementType: O O O N N C C C C C C C C C C C C C C C C C C C H H H H H H H H H H H H H H H H H H H H H H
charge: -0.421430 -0.239739 -0.231956 -0.206926 -0.432029 0.419475 -0.037824 -0.508274 -0.524000 -0.454891 -0.414519 -0.403481 0.359688 0.132377 -0.483446 -0.518479 -0.745655 0.272401 0.077614 0.201879 -0.408669 -0.391702 -0.249095 -0.224274 0.222612 0.228401 0.257526 0.224304 0.242512 0.227665 0.231682 0.206000 0.259409 0.216319 0.237848 0.247133 0.286016 0.351932 0.222399 0.235399 0.219875 0.320040 0.274084 0.251422 0.235295 0.235082
chargesum: 0.00000
title: Mulliken charges with hydrogens summed into heavy atoms:
elementType: O O O N N C C C C C C C C C C C C C C C C C C C
charge: -0.069498 -0.239739 -0.231956 -0.206926 -0.111989 0.419475 -0.037824 -0.057261 -0.042169 0.015286 0.023163 0.072247 0.359688 0.132377 0.001535 -0.232463 -0.067982 0.272401 0.077614 0.201879 -0.134585 -0.140280 -0.013800 0.010808
polarizability: 2.64285530e+02 1.86186851e+01 2.12911916e+02 -7.76354934e+00 -1.60895201e+01 1.86064204e+02
1716.lowfreq: -3.6230 -0.0002 0.0003 0.0006 2.8095 15.1493 56.0229 70.0941 72.9529
frequency: 55.9755 70.0551 72.9419 90.9279 104.1114 122.7676 130.5700 169.3584 176.3273 195.0302 210.7885 222.8238 241.3743 258.3854 260.9842 276.7588 293.0014 316.6888 321.2552 340.4736 341.5398 367.6024 375.3915 394.7255 398.0016 438.3823 443.9039 480.8037 485.3161 501.5004 533.2785 549.5717 579.0026 593.5241 612.9606 629.6052 631.8167 663.2238 673.6213 683.4611 691.9536 742.9982 752.9298 768.6909 777.6814 789.0223 797.8995 849.4007 869.1699 879.5612 886.0674 888.6835 905.2536 918.5779 945.0864 953.0256 961.7383 963.9558 983.3673 993.0448 1016.0758 1032.2320 1043.7614 1048.2610 1063.1394 1071.9862 1086.9953 1105.5806 1112.7968 1144.2847 1154.7782 1163.5579 1174.1739 1186.0283 1208.1737 1211.8498 1234.3742 1238.5004 1247.5779 1269.6993 1277.8837 1281.6759 1290.8112 1296.6793 1300.0957 1336.1270 1338.4199 1342.6819 1347.4114 1354.8888 1356.9736 1359.9824 1367.8513 1392.1866 1395.8209 1443.7208 1458.9054 1459.2425 1467.5278 1471.6108 1477.5995 1482.3688 1485.6614 1491.3745 1494.8517 1572.8871 1596.2085 1614.6337 1619.9255 1643.9399 2971.6520 2982.0346 2986.0536 2997.5279 3000.1534 3010.2564 3011.7240 3046.0732 3053.9100 3054.8809 3058.8289 3071.1440 3072.4163 3082.7869 3087.7073 3132.6617 3143.7079 3158.6439 3171.6817 3210.6581 3499.3053 3529.3108
redmass: 6.5909 5.8241 5.2874 4.8085 2.6049 4.0294 3.5240 3.5156 2.9448 3.4563 2.6138 4.9934 2.3006 3.3818 3.9947 2.2372 3.1931 3.2554 3.0448 3.9637 2.6220 2.3776 1.3402 3.3548 4.6408 3.3315 3.1681 2.7240 3.0968 3.7899 3.5110 3.4851 1.6952 2.6882 3.5993 6.1000 4.7709 5.0019 4.1585 4.4524 3.9148 2.7722 2.7894 1.3031 1.5452 3.3934 2.9051 2.1226 1.6065 1.7434 2.4223 1.6949 2.6523 3.5205 2.2928 2.5258 1.4437 3.5881 1.7163 1.3344 2.4162 3.1491 2.7392 2.8799 2.3202 2.1294 1.7856 2.6120 1.6853 2.3545 2.4018 2.2839 1.0639 1.6889 1.7464 1.7664 1.4417 1.6980 1.4555 1.5829 1.4745 3.0081 1.4825 1.4817 1.5713 1.5716 1.4391 1.4249 1.3702 1.7257 3.8261 1.9001 3.0344 1.6647 1.2069 2.4446 1.1016 1.0833 1.0849 1.0815 1.0653 2.7090 1.0491 1.0691 1.0802 6.8321 6.8639 7.4693 6.4495 9.9667 1.0669 1.0368 1.0597 1.0615 1.0627 1.0625 1.0628 1.1000 1.0991 1.0998 1.0995 1.0990 1.0981 1.1002 1.0951 1.0859 1.0903 1.0949 1.0999 1.0984 1.0753 1.0655
irintensity: 0.7345 0.3424 2.3346 0.6271 0.6045 2.9130 0.6826 2.1003 1.5848 2.4271 2.2779 0.7232 0.9003 0.2639 1.6676 0.7264 1.9143 3.7097 12.2909 3.1402 16.5156 3.7818 69.3397 0.9413 3.6306 20.1526 19.2350 8.0875 11.4009 10.1811 10.3082 8.6598 92.2723 5.3826 9.9402 3.8810 14.1986 0.2586 6.5629 19.4848 9.2743 15.7893 9.6359 47.0830 25.6697 6.4969 1.5069 4.8232 2.4670 23.8642 16.6100 21.4460 0.2399 43.8918 18.5413 9.0981 4.9627 49.1253 1.1224 0.3209 14.8426 2.6936 0.2559 4.4021 13.8222 0.3818 4.9711 1.1083 7.6323 11.3924 20.1179 10.6766 0.5504 52.5362 7.0871 2.4658 7.6915 1.2349 35.5043 1.8503 44.6635 5.8074 27.2402 79.9683 19.6287 24.1031 1.5527 3.4521 3.6851 23.7890 6.6759 38.9199 146.0283 3.3580 15.9580 15.3763 18.2486 11.0323 18.3486 22.8452 0.4293 62.8635 8.0762 5.5099 5.8569 15.6086 29.9710 74.9852 154.6393 410.8395 45.1304 24.3954 30.3493 7.4114 51.3783 19.3177 3.7552 15.8909 3.8586 36.4520 37.1880 4.0423 43.9870 53.4927 15.4288 0.7896 8.9589 12.1300 21.6581 1.6180 27.8969 9.1395
temp: 298.150 k
press: 1.00000 atm
elementType: 8 8 8 7 7 6 6 6 6 6 6 6 6 6 6 6 6 6 6 6 6 6 6 6 1 1 1 1 1 1 1 1 1 1 1 1 1 1 1 1 1 1 1 1 1 1
symmnumber: 1
zpe: 990465.1 jmol-1
zpe.correction: 0.377248 hartree
zpe.thermalcorrener: 0.398074 hartree
zpe.thermalcorrenthalpy: 0.399019 hartree
zpe.thermalcorrgfe: 0.330308 hartree
zpe.sumelectzpe: -1070.650367 hartree
zpe.sumelectthermal: -1070.629541 hartree
zpe.sumelectthermalent: -1070.628597 hartree
zpe.sumelectthermalfe: -1070.697307 hartree
dipole: 2.9914 5.2906 -1.8930
dipole: 6.3657
quadrupole: -124.1534 -159.3937 -143.8714
quadrupole: -12.6033 -2.0255 3.8066
quadrupole: 18.3194 -16.9208 -1.3985 -12.6033 -2.0255 3.8066
hfenergy: -1071.0276153 hartree
pointgroup: C01 [X(C19H22N2O3)]
dipole: 1.0957343 -1.809272 1.3409919 debye
polarizability: 262.6264934|-19.5930558|202.720934|10.4384447|-21.2793952|197.9142226 unknown
InChI: InChI=1S/C19H22N2O3/c1-2-18-9-5-11-21-17(23)12-14(19(18,21)24)13-6-3-4-7-15(13)20-16(22)8-10-18/h3-4,6-7,12,20,24H,2,5,8-11H2,1H3
charge 0 multiplicity 1
46 atoms
O  -1.10358 -0.433284 2.28864
O  -2.177824 3.37177 0.028075
O  0.51062 1.131039 -3.366812
N  -2.089647 1.093365 0.693464
N  2.087773 0.83003 -1.701629
C  -1.396582 -1.225402 -0.020232
C  -1.077977 0.036097 0.879921
C  -2.919699 -1.556803 0.174223
C  -1.144039 -0.889075 -1.532039
C  -0.567048 -2.457434 0.465644
C  -3.879489 -0.381525 -0.116446
C  -3.526158 0.81686 0.787717
C  0.235047 0.791031 0.558694
C  -1.536662 2.313234 0.279097
C  0.328378 -0.930766 -2.055678
C  -0.062576 2.07747 0.210966
C  -0.743358 -3.741043 -0.37766
C  1.601725 0.215986 0.658174
C  0.942527 0.428599 -2.406413
C  2.523592 0.333911 -0.430405
C  2.059451 -0.37432 1.867261
C  3.875015 -0.053051 -0.265265
C  3.405875 -0.764172 2.024428
C  4.323407 -0.58208 0.963144
H  -3.068324 -1.888327 1.22087
H  -3.175453 -2.411936 -0.477868
H  -1.576547 0.09824 -1.779243
H  -1.731381 -1.621589 -2.115278
H  -0.854539 -2.664137 1.51199
H  0.507396 -2.203561 0.502171
H  -3.82289 -0.076838 -1.177691
H  -4.922865 -0.693885 0.078355
H  -4.051705 1.74117 0.491127
H  -3.795573 0.58376 1.837822
H  0.32723 -1.470879 -3.021694
H  0.983254 -1.498541 -1.377374
H  0.633448 2.867779 -0.069212
H  -1.138068 0.380186 2.857795
H  -1.784952 -4.108713 -0.367953
H  -0.44679 -3.592613 -1.432009
H  -0.108863 -4.548263 0.032523
H  2.5705 1.638922 -2.106373
H  1.346935 -0.506324 2.686762
H  4.56014 0.038431 -1.115509
H  3.739004 -1.200246 2.972101
H  5.372272 -0.874474 1.081419
