program: Gaussian 09
title: 000125025
version: EM64L-G09RevD.01
frameworkgroup: C1[X(C18H17N2O)]
method: RPBEPBE
basis: SDD
operation: Freq
keyword: #p
keyword: freq=noraman
keyword: PBEPBE/SDD
title: #p freq=noraman PBEPBE/SDD
converged: YES YES NO NO
title: Mulliken charges:
elementType: O N N C C C C C C C C C C C C C C C C C C H H H H H H H H H H H H H H H H H
charge: -0.412165 -0.115441 -0.072868 0.289785 0.362674 -0.529539 -0.156739 -0.292273 -0.566979 -0.272419 0.442328 0.085288 -0.191375 -0.334953 0.324666 -0.785597 -0.354667 -0.331934 -0.247073 -0.227956 -0.215612 0.265024 0.274207 0.278109 0.278247 0.266471 0.281588 0.270940 0.263737 0.241339 0.254089 0.253360 0.237018 0.299072 0.245961 0.248822 0.253100 0.391763
chargesum: 1.00000
title: Mulliken charges with hydrogens summed into heavy atoms:
elementType: O N N C C C C C C C C C C C C C C C C C C
charge: -0.020402 -0.115441 -0.072868 0.289785 0.362674 0.009692 0.121370 -0.014025 -0.300508 0.009168 0.442328 0.085288 0.079565 -0.071215 0.324666 -0.036809 -0.117649 -0.032862 -0.001112 0.020866 0.037488
polarizability: 2.74499083e+02 -1.90451813e+01 2.24437507e+02 2.76226790e+01 2.86169634e+00 1.56691363e+02
1716.lowfreq: -8.0349 -0.0006 -0.0006 -0.0004 3.1313 9.4309 11.8855 30.5041 47.0001
frequency: 9.3664 30.4729 46.9792 51.5086 84.7343 112.6306 129.2427 143.4168 169.0548 227.5206 240.4803 258.3226 275.7587 285.0134 314.6106 369.3669 396.5459 404.2031 413.0760 442.7371 467.4442 483.5594 487.6343 491.4698 520.6486 540.0145 597.5873 602.9545 615.3863 618.8211 672.6098 693.7891 700.0094 722.9839 742.2389 755.8069 776.8175 814.5823 826.6092 841.7458 847.9199 898.2590 923.1866 933.8060 944.4661 951.2578 982.7589 985.1002 986.7405 989.8181 1001.3238 1010.4048 1012.7336 1017.0423 1037.0009 1049.3707 1052.9552 1097.3647 1100.2192 1171.2881 1184.1021 1185.9703 1201.6475 1211.3156 1218.9728 1239.4172 1254.0056 1275.7962 1291.7465 1301.4196 1327.9912 1344.7187 1369.2415 1382.4565 1395.4444 1407.2177 1420.2819 1439.0430 1442.4375 1464.7173 1467.4361 1477.2785 1481.0305 1504.9092 1532.0620 1573.8642 1581.1378 1584.9279 1599.4292 1608.1570 1631.7400 2989.4274 3027.3177 3067.5136 3087.3718 3106.4671 3129.8470 3146.0359 3146.3404 3148.1359 3157.9634 3161.0174 3174.4786 3181.0030 3189.6557 3206.8171 3210.8183 3545.3053
redmass: 5.2722 4.5797 4.4134 4.3988 1.0870 3.5582 4.5219 3.9010 5.3008 5.2569 5.3312 4.3852 3.9097 3.7051 5.2434 3.0129 2.7040 2.9254 3.2845 4.4435 3.1318 2.0555 2.3837 2.5763 4.5186 6.0137 3.5501 5.6784 5.9024 2.9455 5.1686 1.7337 4.9984 5.4945 5.2448 2.1827 1.9045 1.6667 1.4234 3.4223 1.4129 1.4181 2.2868 1.7057 1.6774 2.7827 2.8067 1.4705 1.5597 3.0902 1.4023 1.5493 1.3510 3.8920 2.8268 2.5170 1.6014 1.8067 2.0026 1.4148 1.0670 1.5030 1.5473 1.1472 1.3041 2.0492 3.2711 2.3189 1.6368 1.4524 1.2445 1.3955 1.9760 6.3737 2.9102 1.2952 3.6296 2.3032 2.3744 1.0464 1.6354 1.5976 1.9029 1.2108 3.3442 5.0593 5.9775 5.8768 5.6705 5.7773 6.1356 1.0386 1.0621 1.0971 1.1021 1.0992 1.0873 1.0920 1.0883 1.0918 1.0940 1.0924 1.1001 1.0955 1.0924 1.1004 1.0945 1.0677
irintensity: 0.0171 0.1446 0.2355 0.6942 1.4156 0.2165 3.2181 2.2932 4.0620 0.4922 0.6869 0.7062 0.4053 0.0082 0.8774 1.2324 3.2615 18.9691 6.6802 0.3385 2.2019 38.8377 33.0735 31.0832 2.0426 6.8570 32.6199 11.9837 3.6459 4.7525 15.9608 61.6835 0.4753 0.6366 13.5201 22.1257 45.8497 6.3299 67.1442 9.1044 2.8800 5.5599 12.4137 2.3066 34.1979 36.3214 19.6403 3.5395 1.2516 12.0884 2.1377 8.5460 0.0289 23.1173 3.2159 9.0645 12.4574 4.4820 0.4713 8.1240 1.2815 6.9463 7.2909 2.2140 4.9232 36.2063 23.2994 16.7720 3.7466 76.0025 17.5548 7.5198 3.4754 3.1656 23.3100 47.5581 33.8834 16.7797 10.2299 17.9679 4.8057 16.5517 17.6156 6.7230 88.7035 14.1846 39.0443 8.3230 19.3531 7.6571 14.5605 3.2847 8.7468 6.0871 1.3414 10.8073 14.5776 2.2293 1.2983 2.7656 16.5736 0.5090 11.5133 1.0305 0.7244 1.2798 3.7319 77.3336
temp: 298.150 k
press: 1.00000 atm
elementType: 8 7 7 6 6 6 6 6 6 6 6 6 6 6 6 6 6 6 6 6 6 1 1 1 1 1 1 1 1 1 1 1 1 1 1 1 1 1
symmnumber: 1
zpe: 804166.9 jmol-1
zpe.correction: 0.306291 hartree
zpe.thermalcorrener: 0.324280 hartree
zpe.thermalcorrenthalpy: 0.325225 hartree
zpe.thermalcorrgfe: 0.258092 hartree
zpe.sumelectzpe: -879.110531 hartree
zpe.sumelectthermal: -879.092542 hartree
zpe.sumelectthermalent: -879.091598 hartree
zpe.sumelectthermalfe: -879.158730 hartree
dipole: 5.4648 -1.7093 -1.2726
dipole: 5.8656
quadrupole: -60.9321 -87.8932 -107.2293
quadrupole: -5.8768 6.0126 2.3143
quadrupole: 24.4194 -2.5417 -21.8777 -5.8768 6.0126 2.3143
hfenergy: -879.4168223 hartree
pointgroup: C01 [X(C18H17N2O1)]
dipole: 2.1234821 0.7852643 0.4468464 debye
polarizability: 272.7964697|19.1437268|225.9407568|-29.2706223|-2.609865|156.8907259 unknown
InChI: InChI=1S/C18H17N2O/c1-14-9-10-18-16(12-14)8-5-11-20(18)13-17(19-21)15-6-3-2-4-7-15/h2-12,21H,13H2,1H3
charge 1 multiplicity 1
38 atoms
O  -1.665354 0.578947 -2.674574
N  0.795298 1.309203 0.504031
N  -0.908366 0.939795 -1.500681
C  1.696466 0.242543 0.337501
C  3.069956 0.551087 0.002022
C  -0.631243 1.037772 0.851724
C  1.17863 2.600843 0.305137
C  1.302545 -1.116935 0.490218
C  4.009031 -0.519402 -0.145583
C  3.450406 1.914994 -0.181039
C  3.628904 -1.856286 0.018427
C  -1.478538 0.590112 -0.357017
C  2.504018 2.935837 -0.037065
C  2.251968 -2.129324 0.333246
C  -2.756785 -0.097388 -0.064699
C  4.609919 -2.996973 -0.131529
C  -3.306901 -0.021615 1.253473
C  -3.467864 -0.849052 -1.050127
C  -4.515886 -0.667895 1.573863
C  -4.67009 -1.504888 -0.716558
C  -5.202053 -1.417557 0.590083
H  -1.045514 1.964554 1.286083
H  -0.655905 0.271993 1.643682
H  0.405798 3.362414 0.425871
H  0.26633 -1.389374 0.702486
H  5.046593 -0.270511 -0.394629
H  4.487678 2.153514 -0.438276
H  2.762874 3.986542 -0.179815
H  1.936526 -3.172459 0.448933
H  5.621395 -2.640757 -0.383834
H  4.679883 -3.584544 0.802612
H  4.28726 -3.695897 -0.925198
H  -2.816235 0.565038 2.038411
H  -3.077787 -0.913274 -2.065771
H  -4.925676 -0.585133 2.585654
H  -5.198081 -2.080639 -1.483664
H  -6.1408 -1.922874 0.839129
H  -1.124097 0.958289 -3.415529
