program: Gaussian 09
title: 000125014
version: EM64L-G09RevD.01
frameworkgroup: C1[X(C9H13N3O5S)]
method: RPBEPBE
basis: SDD
operation: Freq
keyword: #p
keyword: freq=noraman
keyword: PBEPBE/SDD
title: #p freq=noraman PBEPBE/SDD
converged: YES YES NO NO
title: Mulliken charges:
elementType: S O O O O O N N N C C C C C C C C C H H H H H H H H H H H H H
charge: 0.103152 -0.317430 -0.456110 -0.494395 -0.426585 -0.266667 -0.118558 -0.126922 -0.622569 -0.128792 -0.178622 -0.045972 -0.031514 -0.351826 -0.255534 -0.226941 0.119788 0.143611 0.283437 0.237908 0.276514 0.263661 0.199392 0.212883 0.395516 0.380882 0.274629 0.360553 0.125490 0.347204 0.323817
chargesum: 0.00000
title: Mulliken charges with hydrogens summed into heavy atoms:
elementType: S O O O O O N N N C C C C C C C C C
charge: 0.228642 -0.317430 -0.060595 -0.113513 -0.066031 -0.266667 -0.118558 -0.126922 0.048452 0.154645 0.059286 0.230542 0.232147 0.060449 -0.255534 0.047689 0.119788 0.143611
polarizability: 2.03982869e+02 6.72934187e+00 1.59358518e+02 2.02835948e+00 -1.46551347e+01 8.93110599e+01
1716.lowfreq: -6.7334 -0.0017 -0.0005 0.0013 4.3005 7.6096 19.4689 42.9489 48.8586
frequency: 18.3300 42.9201 48.8275 57.1119 79.0486 93.8183 123.7188 147.9662 151.2046 175.7086 198.4258 235.1879 243.6623 269.3253 312.4125 313.8337 330.2407 347.0513 384.6764 410.7060 423.8624 434.6032 472.7788 528.7074 529.2001 551.3287 570.1052 597.5772 609.8067 632.0204 638.5215 652.1261 655.5747 685.3790 763.9238 786.4413 822.4261 837.4161 858.3830 939.9901 967.1632 984.7273 993.5222 1020.4744 1024.6450 1034.7182 1040.2525 1055.4312 1069.2118 1082.3981 1098.9380 1161.9754 1172.6076 1187.7170 1210.4887 1224.7121 1231.0635 1254.1759 1260.7611 1269.5982 1301.2827 1318.5646 1334.5603 1340.5759 1352.8717 1367.3458 1372.2294 1385.4118 1397.6849 1433.0475 1457.3447 1527.7261 1571.9312 1624.6725 2175.8410 2954.9376 2965.9572 3008.2891 3021.9809 3064.3402 3067.1958 3264.7626 3371.1036 3503.5279 3557.2472 3627.5791 3676.7326
redmass: 6.2477 5.8588 7.2518 6.8203 7.9153 3.8294 7.2202 7.0817 4.4698 5.8457 1.3653 5.6128 6.0968 5.2558 4.7462 3.9777 5.2181 3.7426 4.3976 8.2946 1.1819 1.1167 5.3227 1.6338 2.3049 5.9233 3.5941 1.5090 3.9592 3.4633 1.3109 2.7107 4.0642 3.8855 4.8544 1.6360 3.7128 3.7049 2.9671 2.9868 4.9006 3.0971 4.4623 3.4498 2.0924 3.5626 2.4915 3.6116 1.8145 4.6624 2.2410 1.2417 2.0290 1.3210 2.0760 1.3831 1.2450 1.7638 1.4940 1.6133 1.4569 1.6730 3.2123 1.2788 1.3875 1.4132 4.4836 1.3044 1.3943 4.6483 1.0893 5.1499 1.5555 4.8902 1.0401 1.0680 1.0845 1.0846 1.0872 1.0881 1.0958 1.0982 1.0640 1.0455 1.0660 1.0676 1.1037
irintensity: 4.5577 0.7343 1.3673 2.4313 5.4845 9.8060 8.7363 5.7050 4.8936 14.3899 105.2315 12.6378 4.4437 13.7204 1.2095 7.1278 9.0752 5.1623 8.2317 4.8955 143.1094 70.3207 1.7688 81.6359 89.5745 2.3754 6.6208 87.2895 23.6120 14.7313 135.6404 3.2935 22.8274 72.4154 18.2368 13.0055 8.5586 20.7797 39.2237 75.3598 68.3776 79.3209 115.5787 31.9959 5.4127 53.2111 34.4608 17.4391 3.6017 8.3904 15.8289 25.3867 7.3436 18.9705 22.6048 11.6665 29.2077 94.0397 47.5190 19.7592 5.5283 39.0385 69.1917 8.9456 1.8023 96.0388 3.6071 45.0329 36.5842 41.8760 5.4120 77.6281 308.9866 246.9298 195.8471 47.1078 8.3956 21.6341 25.9251 15.8376 31.1620 0.3429 130.8910 42.5116 12.7834 37.4113 59.4344
temp: 298.150 k
press: 1.00000 atm
elementType: 16 8 8 8 8 8 7 7 7 6 6 6 6 6 6 6 6 6 1 1 1 1 1 1 1 1 1 1 1 1 1
symmnumber: 1
zpe: 600308.1 jmol-1
zpe.correction: 0.228645 hartree
zpe.thermalcorrener: 0.246788 hartree
zpe.thermalcorrenthalpy: 0.247732 hartree
zpe.thermalcorrgfe: 0.180905 hartree
zpe.sumelectzpe: -1287.780912 hartree
zpe.sumelectthermal: -1287.762769 hartree
zpe.sumelectthermalent: -1287.761825 hartree
zpe.sumelectthermalfe: -1287.828652 hartree
dipole: 9.2252 0.2334 2.7391
dipole: 9.6261
quadrupole: -112.0451 -114.7889 -114.4678
quadrupole: 29.2533 3.2589 -2.8092
quadrupole: 1.7222 -1.0216 -0.7005 29.2533 3.2589 -2.8092
hfenergy: -1288.0095569 hartree
pointgroup: C01 [X(C9H13N3O5S1)]
dipole: 3.6137479 -0.1882431 1.1172995 debye
polarizability: 204.5280746|4.2403742|160.5143466|3.1407566|-9.517364|87.6100259 unknown
InChI: InChI=1S/C9H13N3O5S/c10-7(16)4-9(18)12(2-11-4)8-6(15)5(14)3(1-13)17-8/h2-3,5-6,8,13-15,18H,1,10H2
charge 0 multiplicity 1
31 atoms
S  -1.79683 2.316154 -0.617735
O  1.645872 -0.865692 -0.575759
O  1.089887 2.396122 0.990082
O  3.467285 2.023155 0.135934
O  3.86613 -2.656819 -0.931132
O  -4.775917 1.019919 -0.372366
N  -0.578519 -0.211918 -0.119243
N  -2.290021 -1.641538 0.249639
N  -5.017609 -1.208258 0.309267
C  1.424296 0.986656 0.906579
C  2.958361 0.756996 0.691815
C  0.775108 0.287949 -0.329087
C  3.04659 -0.403569 -0.338984
C  3.835301 -1.634557 0.110323
C  -1.759633 0.552131 -0.236433
C  -0.957073 -1.527265 0.190039
C  -2.806797 -0.354277 -0.017227
C  -4.269534 -0.099648 -0.047515
H  1.074099 0.492698 1.828022
H  3.467351 0.521297 1.645277
H  0.769171 0.987604 -1.192337
H  3.450038 -0.008607 -1.292415
H  3.402467 -2.0298 1.055202
H  4.892066 -1.366244 0.284264
H  1.874171 2.890229 0.607108
H  4.426859 2.146589 0.328218
H  -0.232131 -2.322158 0.328435
H  2.931861 -2.862691 -1.192755
H  -0.621125 2.614126 0.099506
H  -4.535819 -2.080261 0.534337
H  -6.033104 -1.145824 0.30234
