program: Gaussian 09
title: 000125010
version: EM64L-G09RevD.01
frameworkgroup: C1[X(C5H12O11P2)]
method: RPBEPBE
basis: SDD
operation: Freq
keyword: #p
keyword: freq=noraman
keyword: PBEPBE/SDD
title: #p freq=noraman PBEPBE/SDD
converged: YES YES NO NO
title: Mulliken charges:
elementType: P P O O O O O O O O O O O C C C C C H H H H H H H H H H H H
charge: 1.398578 1.421445 -0.235263 -0.569118 -0.408720 -0.411347 -0.499108 -0.664757 -0.747102 -0.563307 -0.813726 -0.673154 -0.567424 -0.149993 -0.043137 -0.196854 -0.014623 -0.302387 0.263133 0.255905 0.252563 0.280726 0.243034 0.262656 0.339111 0.370736 0.463089 0.419002 0.481688 0.408355
chargesum: 0.00000
title: Mulliken charges with hydrogens summed into heavy atoms:
elementType: P P O O O O O O O O O O O C C C C C
charge: 1.398578 1.421445 -0.235263 -0.569118 -0.069609 -0.040612 -0.499108 -0.201669 -0.328100 -0.563307 -0.332038 -0.264798 -0.567424 0.113140 0.212768 0.055708 0.266103 0.203302
polarizability: 1.53861308e+02 -2.63723646e+00 1.46909320e+02 2.74044573e+00 -2.87359447e+00 1.11634574e+02
1716.lowfreq: -7.2065 0.0005 0.0013 0.0018 4.8308 11.6751 34.7726 46.5146 50.0613
frequency: 34.2078 46.5116 49.9202 73.6593 85.9692 112.1802 115.5738 127.9956 153.5882 163.6906 178.3956 189.8727 209.8030 222.1291 240.8375 251.9296 266.7118 290.4977 302.7336 310.0506 328.7763 349.0630 357.3791 366.9708 375.4001 393.3071 411.9702 447.9797 465.4187 480.7484 489.3824 554.8712 581.4456 601.6784 639.9396 644.9361 708.5017 721.8555 746.2713 772.0025 776.0576 794.4993 804.9684 868.4545 909.0229 954.6679 978.0427 991.5119 1007.4358 1010.9985 1011.2539 1055.1779 1067.7308 1078.7859 1085.1564 1095.0291 1119.0916 1143.7404 1182.1893 1208.0382 1226.8628 1242.6976 1259.5096 1304.4914 1311.5466 1331.8068 1334.9467 1337.1827 1367.8395 1378.0161 1385.5556 1445.7114 2914.9094 3019.7894 3027.7322 3043.8912 3062.9332 3097.4149 3113.1179 3231.7945 3519.6252 3549.0185 3608.5965 3611.0805
redmass: 8.0018 9.6414 7.0771 7.5180 9.0996 9.0789 2.0844 7.2103 3.9540 10.6182 5.4175 2.5390 5.4993 6.2466 1.4839 5.1235 3.6910 4.1313 3.1552 5.3679 2.5659 3.9930 4.1860 8.0716 6.1711 4.3212 4.7153 2.9642 1.6723 5.8757 3.3541 4.1489 6.0299 6.4246 6.4694 7.2752 2.2863 6.5818 2.6483 3.7397 4.8843 4.4351 6.4333 1.2621 3.7401 5.9502 1.4474 2.3217 2.6575 1.9529 2.2613 2.8145 3.9689 3.5483 4.1202 7.3387 2.6634 1.2976 1.3367 1.2337 1.1443 1.4220 1.5020 1.2095 1.1369 1.3786 1.2997 1.2229 1.3015 1.1874 1.1969 1.0795 1.0687 1.0587 1.0849 1.0862 1.0863 1.1080 1.0904 1.0688 1.0649 1.0663 1.0666 1.0666
irintensity: 2.3164 2.8882 2.5608 0.7202 0.8687 2.3914 57.6466 6.6151 23.8477 8.8557 13.2968 45.6911 23.0920 20.0313 31.2407 18.9788 64.8165 59.9442 6.4800 38.0304 102.9075 1.8699 33.6862 3.7318 40.8917 12.4466 2.3483 31.6313 141.9468 30.7318 21.6741 4.6163 3.2492 29.9469 43.1159 6.9311 112.1676 54.3737 244.0057 49.7139 99.4474 30.2480 388.8979 432.0144 132.6115 275.0883 75.0941 6.5051 50.1238 121.1326 35.9913 19.7681 25.7752 14.5375 240.0775 89.4909 3.8450 573.6239 35.5606 24.2813 11.1216 16.7584 2.9402 0.3775 3.8855 40.3604 16.5716 34.2414 0.9941 21.4327 26.7459 13.3115 894.8097 12.4711 12.1905 7.9011 23.8516 8.9652 12.5886 678.7704 25.6608 12.3151 85.4069 89.4469
temp: 298.150 k
press: 1.00000 atm
elementType: 15 15 8 8 8 8 8 8 8 8 8 8 8 6 6 6 6 6 1 1 1 1 1 1 1 1 1 1 1 1
symmnumber: 1
zpe: 530735.7 jmol-1
zpe.correction: 0.202147 hartree
zpe.thermalcorrener: 0.222867 hartree
zpe.thermalcorrenthalpy: 0.223811 hartree
zpe.thermalcorrgfe: 0.153094 hartree
zpe.sumelectzpe: -1706.161284 hartree
zpe.sumelectthermal: -1706.140563 hartree
zpe.sumelectthermalent: -1706.139619 hartree
zpe.sumelectthermalfe: -1706.210336 hartree
dipole: 0.6651 -0.9039 1.9269
dipole: 2.2299
quadrupole: -137.9685 -125.8883 -119.5208
quadrupole: 13.8565 -18.8005 4.9127
quadrupole: -10.1760 1.9043 8.2717 13.8565 -18.8005 4.9127
hfenergy: -1706.3634305 hartree
pointgroup: C01 [X(C5H12O11P2)]
dipole: 0.2960796 0.0878544 -0.8211387 debye
polarizability: 153.3476009|-2.2753678|144.7423607|-8.0447347|-6.699691|114.3152396 unknown
InChI: InChI=1S/C5H12O11P2/c6-3-2(1-14-17(8,9)10)15-5(4(3)7)16-18(11,12)13/h2-9,11-12H,1H2
charge 0 multiplicity 1
30 atoms
P  -1.789465 -1.891678 0.781519
P  2.906825 -1.183632 -0.225273
O  -0.180812 0.474746 -1.198401
O  -1.720683 -0.171012 0.55811
O  -0.400799 3.941804 0.004406
O  -3.114582 2.148813 0.269392
O  2.653744 0.492255 -0.413993
O  -0.536949 -2.186183 1.866117
O  -1.078632 -2.389027 -0.761796
O  -3.195613 -2.521154 1.110008
O  1.358107 -1.867688 0.132266
O  3.538683 -1.234568 1.367631
O  3.731885 -1.865327 -1.383193
C  -0.599953 2.50682 0.108284
C  0.509861 1.673088 -0.598234
C  -1.922478 1.95655 -0.513332
C  -1.554045 0.479025 -0.783425
C  1.61239 1.2242 0.354371
H  -0.609799 2.31073 1.194441
H  0.950134 2.227086 -1.446311
H  -2.11512 2.456355 -1.481744
H  -2.146822 -0.057327 -1.537881
H  1.204606 0.602314 1.171505
H  2.123988 2.106141 0.776953
H  -0.608816 4.250105 -0.914658
H  -3.088483 1.504789 1.026552
H  0.38787 -2.080403 1.424188
H  -1.496941 -3.182721 -1.180134
H  0.690073 -1.999566 -0.615766
H  4.091925 -2.026634 1.5841
