program: Gaussian 09
title: 000144671
version: EM64L-G09RevD.01
frameworkgroup: C1[X(C7H9I)]
method: RPBEPBE
basis: SDD
operation: Freq
keyword: #p
keyword: freq=noraman
keyword: PBEPBE/SDD
title: #p freq=noraman PBEPBE/SDD
converged: YES YES NO YES
title: Mulliken charges:
elementType: I C C C C C C C H H H H H H H H H
charge: 0.032246 -0.306990 -0.147526 -0.147774 -0.147456 -0.488434 -0.488673 -0.488334 0.271520 0.271274 0.271627 0.223268 0.232938 0.232983 0.223241 0.223194 0.232897
chargesum: 0.00000
title: Mulliken charges with hydrogens summed into heavy atoms:
elementType: I C C C C C C C
charge: 0.032246 -0.306990 0.123994 0.123500 0.124171 -0.032229 -0.032449 -0.032243
polarizability: 1.24261736e+02 -2.09331173e-02 7.09394362e+01 -1.77802427e-02 1.04207959e-03 7.09223488e+01
1716.lowfreq: -16.1213 -10.8427 0.0004 0.0004 0.0006 27.5736 144.9884 148.6836 221.2019
frequency: 144.9757 148.6352 221.2017 321.7849 324.0320 412.6807 599.5668 600.5786 743.2980 806.9397 808.4213 896.8591 897.9718 921.1822 933.7975 952.6989 984.7237 986.6956 1029.4050 1031.2601 1059.0177 1071.3548 1072.3232 1115.0380 1174.2293 1175.4952 1182.8002 1194.8795 1248.4313 1249.6506 1258.5048 1288.7694 1290.3970 1445.2227 1445.9483 1461.4562 3008.5231 3008.8478 3011.7028 3080.4420 3080.9873 3083.4797 3097.9779 3098.9549 3106.4356
redmass: 3.3404 3.3340 6.9154 2.2270 2.2274 1.6491 3.4894 3.4869 2.5483 2.1638 2.1690 1.8381 1.8332 2.9319 1.6802 4.0787 2.8133 2.7732 2.4129 2.4280 1.1137 1.2290 1.2292 2.7272 1.3738 1.3724 1.7532 1.8512 1.6496 1.6624 1.2730 1.5191 1.5303 1.0970 1.0968 1.1059 1.0590 1.0591 1.0589 1.1068 1.1068 1.1065 1.0914 1.0914 1.0962
irintensity: 0.0048 0.0045 5.9123 0.0308 0.0317 0.4429 0.6267 0.6350 15.2834 3.2680 3.2196 0.0198 0.0229 36.7326 0.0001 28.6962 0.6101 0.6537 1.9228 1.9889 0.0010 5.2183 5.3013 12.0388 0.0113 0.0731 0.0087 52.6637 8.7343 8.7420 0.0194 2.8785 2.7459 4.9301 4.9318 3.2704 39.8734 39.9441 61.8398 3.2707 4.5492 46.2816 56.2729 55.9932 7.7349
temp: 298.150 k
press: 1.00000 atm
elementType: 53 6 6 6 6 6 6 6 1 1 1 1 1 1 1 1 1
symmnumber: 1
zpe: 365325.0 jmol-1
zpe.correction: 0.139145 hartree
zpe.thermalcorrener: 0.146111 hartree
zpe.thermalcorrenthalpy: 0.147055 hartree
zpe.thermalcorrgfe: 0.106192 hartree
zpe.sumelectzpe: -282.963460 hartree
zpe.sumelectthermal: -282.956494 hartree
zpe.sumelectthermalent: -282.955550 hartree
zpe.sumelectthermalfe: -282.996413 hartree
dipole: 2.5181 -0.0001 0.0009
dipole: 2.5181
quadrupole: -60.6099 -61.8074 -61.8067
quadrupole: -0.0017 -0.0088 -0.0017
quadrupole: 0.7981 -0.3994 -0.3987 -0.0017 -0.0088 -0.0017
hfenergy: -283.1026052 hartree
pointgroup: C01 [X(C7H9I1)]
dipole: 0.9907097 -0.0008828 -0.0006561 debye
dipolederiv: -0.7549603 0.0006483 0.0005265 0.0017037 -0.1208245 0.0000339 0.0002521 0.0000471 -0.1208056 1.1289425 -0.0012892 -0.0008966 -0.0019034 0.0595918 0.0001986 -0.0007663 0.0003597 0.0590805 -0.0836337 -0.0477918 -0.1125136 0.0358788 0.0709517 0.0307223 0.0826249 0.0304837 0.1303711 -0.0831331 0.1214537 0.0146434 -0.0883182 0.1423391 0.0097345 -0.0112246 0.0097849 0.059357 -0.0831939 -0.0735365 0.0986186 0.0535319 0.0884381 -0.0400845 -0.0702667 -0.0403045 0.1122101 0.0313539 0.0280197 -0.0372908 -0.0205233 -0.0626257 -0.0610687 0.0273881 -0.0610988 -0.0269214 0.0317439 -0.0462147 -0.0057295 0.0326625 0.0171304 0.0149697 0.0037746 0.0153373 -0.1070935 0.0318899 0.018369 0.0424836 -0.0130609 -0.0889076 0.0457492 -0.0308468 0.0457766 -0.0007758 0.0767969 0.0348395 0.0818189 0.0195367 0.0071134 -0.0643038 0.0455431 -0.0641638 -0.1160874 0.0766608 -0.0880382 -0.0105898 -0.0497703 -0.1410272 -0.021063 -0.0060442 -0.0211074 0.0319974 0.0761946 0.0537059 -0.071675 0.0303017 -0.0296019 0.0852462 -0.0403998 0.0851994 -0.0788347 -0.2041167 0.0500128 -0.0664716 0.0230534 0.0692854 0.0071423 -0.0309792 0.007217 0.0651632 0.054895 -0.049487 0.0659729 -0.0160524 -0.0159981 0.1101151 0.0212884 0.1100954 -0.0799417 0.0547042 0.0813125 0.0098454 0.0264758 -0.159571 -0.027412 0.0032851 -0.0275373 0.063424 -0.2043275 -0.0822035 -0.0097032 -0.037793 0.0599581 -0.0018286 -0.0043205 -0.0017354 0.074397 -0.2040713 0.0326245 0.0768572 0.0150839 0.0723721 -0.0054724 0.0358538 -0.0055711 0.0618029 0.0542547 -0.0324251 -0.0758964 -0.0108069 0.0313761 -0.0826789 -0.025162 -0.0827829 -0.1273431 unknown
polarizability: 124.261629|-0.0795377|70.9226397|-0.0108765|0.0020369|70.9392521 unknown
InChI: InChI=1S/C7H9I/c8-7-4-1-5(7)3-6(7)2-4/h4-6H,1-3H2
charge 0 multiplicity 1
17 atoms
I  -2.858744 0.003321 0.002038
C  -0.685393 -0.000399 0.001158
C  0.239406 0.507802 1.190195
C  0.238118 -1.28522 -0.155552
C  0.236631 0.776515 -1.034911
C  0.912029 -0.909221 1.210976
C  0.911627 1.503034 0.180775
C  0.909106 -0.594698 -1.394346
H  -0.142889 0.911699 2.136477
H  -0.14404 -2.30682 -0.278416
H  -0.148179 1.394245 -1.856608
H  2.015441 -0.934669 1.244194
H  0.508008 -1.525936 2.032392
H  0.509102 2.523326 0.304787
H  2.015123 1.543492 0.184419
H  2.012548 -0.611045 -1.434798
H  0.504007 -0.997726 -2.33878
