program: Gaussian 09
title: 000144653
version: EM64L-G09RevD.01
frameworkgroup: C1[X(C4H10)]
method: RPBEPBE
basis: SDD
operation: Freq
keyword: #p
keyword: freq=noraman
keyword: PBEPBE/SDD
title: #p freq=noraman PBEPBE/SDD
converged: YES YES NO NO
title: Mulliken charges:
elementType: C C C C H H H H H H H H H H
charge: -0.045114 -0.673297 -0.673320 -0.673315 0.195871 0.202356 0.210368 0.210318 0.202352 0.210361 0.210353 0.202360 0.210341 0.210365
chargesum: 0.00000
title: Mulliken charges with hydrogens summed into heavy atoms:
elementType: C C C C
charge: 0.150757 -0.050255 -0.050253 -0.050249
polarizability: 4.59534501e+01 -1.24662162e-03 4.59448130e+01 -3.01299036e-03 -1.30145635e-03 4.07573515e+01
1716.lowfreq: -18.6464 -0.0006 -0.0005 0.0005 14.7952 23.3415 187.5326 239.6565 248.8596
frequency: 187.5260 239.6530 248.8387 351.1791 357.0445 423.7670 791.1863 908.0644 909.1022 937.5964 967.1265 969.4329 1178.4398 1179.4559 1187.1676 1321.9850 1323.4277 1374.2826 1374.5424 1399.7887 1460.7411 1466.1736 1466.6470 1483.3309 1484.3066 1490.9060 2961.9526 2962.7551 2962.8841 2967.8448 3054.9513 3055.7632 3060.2993 3067.0090 3067.4638 3068.2898
redmass: 1.0131 1.0577 1.0593 2.0816 2.0882 1.9312 2.8448 1.2060 1.2043 1.2006 1.7299 1.7232 1.7740 1.7680 1.9385 1.4755 1.4742 1.2183 1.2195 1.2159 1.0511 1.0437 1.0437 1.0576 1.0577 1.0457 1.0351 1.0439 1.0739 1.0360 1.0997 1.0997 1.1008 1.0991 1.0991 1.0984
irintensity: 0.0006 0.0514 0.0564 0.0834 0.0747 0.9679 1.9118 4.7767 4.8102 0.0052 0.3708 0.3260 7.2580 7.2934 3.2695 3.2867 3.3285 21.3506 21.1584 8.7270 0.0560 1.1375 1.2796 9.5082 9.1063 30.5926 45.6410 41.4844 25.1867 9.5849 10.6208 9.9166 0.2303 71.5289 71.1948 137.5280
temp: 298.150 k
press: 1.00000 atm
elementType: 6 6 6 6 1 1 1 1 1 1 1 1 1 1
symmnumber: 1
zpe: 339206.7 jmol-1
zpe.correction: 0.129197 hartree
zpe.thermalcorrener: 0.135047 hartree
zpe.thermalcorrenthalpy: 0.135991 hartree
zpe.thermalcorrgfe: 0.101380 hartree
zpe.sumelectzpe: -158.064963 hartree
zpe.sumelectthermal: -158.059113 hartree
zpe.sumelectthermalent: -158.058169 hartree
zpe.sumelectthermalfe: -158.092780 hartree
dipole: -0.0003 -0.0003 -0.0960
dipole: 0.0960
quadrupole: -28.2224 -28.2255 -27.5884
quadrupole: 0.0002 -0.0014 -0.0011
quadrupole: -0.2103 -0.2134 0.4237 0.0002 -0.0014 -0.0011
hfenergy: -158.19416 hartree
pointgroup: C01 [X(C4H10)]
dipole: 0.0001793 -0.000074 -0.0377566 debye
dipolederiv: 0.1489658 -0.0000246 0.0000163 0.00012 0.1491912 -0.0000321 -0.0000903 0.0000577 0.163046 0.0192898 0.043583 0.0161303 0.0434823 -0.0731622 -0.0405946 0.010282 -0.0256059 0.0869197 -0.087523 0.0185003 -0.0433252 0.0183363 0.0339613 0.0063026 -0.0274809 0.003947 0.0868473 -0.0122101 -0.0619148 0.0271403 -0.0619138 -0.0416675 0.0344428 0.0172539 0.0216429 0.0868765 0.024146 0.000056 0.0000095 0.0000372 0.0240316 -0.0000551 0.0000651 0.0000123 -0.2264477 0.0890008 0.0097877 -0.0114863 0.0097411 0.0681324 0.0280022 0.016465 -0.0423353 -0.187506 0.0011311 -0.1462813 0.0611493 -0.100871 -0.1102763 0.0494719 0.0549198 0.0668915 0.0606669 -0.1750547 0.085405 -0.0780384 0.0399384 0.0655323 -0.0059615 -0.0854581 0.0108238 0.0610595 0.0647585 0.0040991 0.0301094 0.004216 0.0922489 -0.0042283 -0.0448151 0.0066624 -0.1875693 -0.0492667 -0.1129694 0.0340332 -0.1583226 -0.0602743 0.0705668 0.0522071 0.0685106 0.0609836 0.0247293 0.0872109 0.0121859 0.1326821 -0.1341524 -0.077532 0.0302733 -0.0807309 0.0609077 0.0818325 -0.0138052 -0.0193453 -0.0139576 0.0752889 -0.0234955 0.0278788 0.0358769 -0.1875198 0.0600113 0.0951478 0.0443698 0.049807 -0.1690444 -0.0650324 0.0333301 -0.0799107 0.0606393 -0.1898106 -0.0087946 -0.0729487 0.0367044 0.0801903 0.0281452 -0.0848306 0.0141577 0.0610964 unknown
polarizability: 45.9454153|-0.0025311|45.9528439|0.0045859|-0.0031207|40.7573553 unknown
InChI: InChI=1S/C4H10/c1-4(2)3/h4H,1-3H3
charge 0 multiplicity 1
14 atoms
C  0.000001 0.000285 -0.362755
C  -0.542542 1.367769 0.115883
C  1.455218 -0.214291 0.116762
C  -0.912879 -1.153411 0.116061
H  0.000273 0.000092 -1.473472
H  -0.559328 1.413868 1.222443
H  0.089065 2.200258 -0.247892
H  -1.574091 1.539271 -0.245829
H  1.503315 -0.221799 1.223397
H  2.120423 0.592416 -0.245153
H  1.859589 -1.178351 -0.245657
H  -0.941645 -1.193068 1.222637
H  -0.547079 -2.132148 -0.248009
H  -1.950321 -1.021089 -0.245016
