program: Gaussian 09
title: 000144654
version: EM64L-G09RevD.01
frameworkgroup: C1[X(C10H14ClPSi)]
method: RPBEPBE
basis: SDD
operation: Freq
keyword: #p
keyword: freq=noraman
keyword: PBEPBE/SDD
title: #p freq=noraman PBEPBE/SDD
converged: YES YES NO NO
title: Mulliken charges:
elementType: Cl P Si C C C C C C C C C C H H H H H H H H H H H H H H
charge: -0.272624 0.445623 1.335639 -0.967365 -1.005149 -1.015754 -1.029832 0.534134 -0.376465 -0.364552 -0.221113 -0.234733 -0.236253 0.244983 0.259050 0.235126 0.242476 0.249963 0.244443 0.242009 0.249256 0.249124 0.257246 0.244050 0.230725 0.228397 0.231595
chargesum: 0.00000
title: Mulliken charges with hydrogens summed into heavy atoms:
elementType: Cl P Si C C C C C C C C C C
charge: -0.272624 0.445623 1.335639 -0.967365 -0.265991 -0.278872 -0.289443 0.534134 -0.119219 -0.120501 0.009611 -0.006336 -0.004657
polarizability: 2.02794932e+02 9.72128097e+00 1.91193779e+02 -8.46103767e+00 9.20655731e+00 1.17857383e+02
1716.lowfreq: -11.1281 -10.4825 0.0014 0.0017 0.0035 6.5760 9.5224 35.5863 63.1458
frequency: 4.4736 35.2308 63.1242 83.6434 105.5083 127.7225 139.4479 152.0242 160.6919 167.5472 173.3948 180.4750 217.6777 221.8473 236.2242 295.3016 363.2306 398.2926 418.3289 470.7188 546.4310 592.0531 614.2647 641.1001 689.2585 696.6681 700.1938 750.2877 757.5414 802.9162 811.3240 830.3273 845.8319 902.8882 906.1516 916.2868 924.7486 974.4646 985.7522 991.5858 995.9391 1033.0640 1082.4826 1172.9033 1191.9753 1271.4280 1292.1760 1297.2178 1309.6888 1312.9270 1367.0251 1428.6923 1439.4848 1443.3001 1445.6970 1451.0065 1456.0268 1461.2581 1473.2891 1574.6977 1599.6595 2982.2086 2984.2670 2985.1321 3079.8710 3083.8237 3087.6743 3094.9309 3098.3793 3101.6031 3127.8171 3137.6903 3154.0139 3163.4161 3172.2100
redmass: 3.3100 3.7487 5.3739 4.9933 4.6046 2.2930 1.0491 1.7924 1.1857 2.4041 4.6647 2.6758 2.5753 3.2130 3.6284 4.3092 8.2604 2.9485 16.4757 4.6832 4.7165 4.4794 6.4128 6.0590 3.3348 1.9203 2.7936 1.1960 1.9397 1.3872 1.3527 4.1050 1.2462 1.4716 1.4766 1.4770 1.5440 1.3885 4.9006 5.1357 1.5212 2.0237 1.6303 1.0525 1.1150 4.6398 1.1991 1.2018 1.2106 1.3678 5.3543 2.3204 1.0562 1.0553 1.0535 1.0489 1.0533 1.0505 2.2142 5.6858 6.0039 1.0350 1.0344 1.0342 1.0973 1.0972 1.0980 1.0987 1.0988 1.0993 1.0848 1.0887 1.0932 1.0951 1.1003
irintensity: 0.2433 0.5968 0.8227 0.5150 0.4082 0.3168 0.0241 0.1118 0.0180 0.0930 1.4483 0.2129 0.7045 2.6361 5.0150 19.1192 5.6148 3.1889 37.2451 21.0157 5.9714 5.1786 0.3070 2.8952 11.3953 44.6924 6.4203 1.2244 27.3615 12.0850 14.3814 28.4003 4.2180 58.8676 73.3129 203.1519 73.3899 0.1979 5.7012 11.4742 4.2150 8.3885 12.2792 0.0160 0.6096 3.0901 39.3176 36.2445 23.2580 2.3118 0.1643 6.5169 0.6659 1.6810 2.7902 11.2757 8.3148 18.4550 9.8768 2.5002 0.2614 9.6785 11.0663 13.4983 10.1114 17.5591 18.6662 9.9472 9.9448 13.9210 0.5243 8.0898 24.6955 21.1033 11.9762
temp: 298.150 k
press: 1.00000 atm
elementType: 17 15 14 6 6 6 6 6 6 6 6 6 6 1 1 1 1 1 1 1 1 1 1 1 1 1 1
symmnumber: 1
zpe: 545784.0 jmol-1
zpe.correction: 0.207878 hartree
zpe.thermalcorrener: 0.224460 hartree
zpe.thermalcorrenthalpy: 0.225404 hartree
zpe.thermalcorrgfe: 0.160781 hartree
zpe.sumelectzpe: -1479.205427 hartree
zpe.sumelectthermal: -1479.188845 hartree
zpe.sumelectthermalent: -1479.187901 hartree
zpe.sumelectthermalfe: -1479.252524 hartree
dipole: 2.2083 -3.7708 0.5582
dipole: 4.4053
quadrupole: -92.5113 -106.5226 -98.4140
quadrupole: 6.1397 -2.9433 4.4959
quadrupole: 6.6380 -7.3733 0.7353 6.1397 -2.9433 4.4959
hfenergy: -1479.4133048 hartree
pointgroup: C01 [X(C10H14Cl1P1Si1)]
dipole: -0.5794261 -1.5011075 0.6441043 debye
polarizability: 206.1716313|-3.9015177|156.9146751|5.22319|-36.9423625|148.759788 unknown
InChI: InChI=1S/C10H14PSi.Cl/c1-12(2,3)10(11)9-7-5-4-6-8-9;/h4-8H,1-3H3;
charge 0 multiplicity 1
27 atoms
Cl 0.667094 3.153184 -1.793305
P  -1.226696 1.906766 -1.41401
Si -2.222379 -0.689023 -0.121009
C  -0.733049 0.512423 -0.534939
C  -1.690077 -2.430759 -0.697239
C  -2.592207 -0.680971 1.760319
C  -3.796738 -0.127496 -1.055065
C  0.629808 0.09386 -0.125353
C  1.682939 0.014102 -1.082614
C  0.914881 -0.258315 1.226341
C  2.9714 -0.412797 -0.700036
C  2.211422 -0.662933 1.608438
C  3.244052 -0.749814 0.646304
H  -1.552007 -2.458631 -1.792841
H  -0.738115 -2.729011 -0.223601
H  -2.46105 -3.176665 -0.427667
H  -1.840431 -1.250929 2.333149
H  -2.633419 0.348837 2.157326
H  -3.577515 -1.153178 1.935796
H  -4.615058 -0.84234 -0.845414
H  -4.137137 0.873782 -0.735685
H  -3.640598 -0.104663 -2.148214
H  1.480009 0.280237 -2.124169
H  0.129269 -0.174841 1.98358
H  3.765523 -0.474073 -1.452351
H  2.415437 -0.909085 2.656568
H  4.248541 -1.071868 0.942089
