program: Gaussian 09
title: 000144637
version: EM64L-G09RevD.01
frameworkgroup: C1[X(C15H32)]
method: RPBEPBE
basis: SDD
operation: Freq
keyword: #p
keyword: freq=noraman
keyword: PBEPBE/SDD
title: #p freq=noraman PBEPBE/SDD
converged: YES YES NO NO
title: Mulliken charges:
elementType: C C C C C C C C C C C C C C C H H H H H H H H H H H H H H H H H H H H H H H H H H H H H H H H
charge: 0.348057 0.370172 -0.483071 -0.402584 -0.427582 -0.764453 -0.757162 -0.767290 -0.785462 -0.399278 -0.375557 -0.349397 -0.352220 -0.700830 -0.701159 0.183225 0.203184 0.180246 0.209791 0.188612 0.191980 0.211337 0.210530 0.215782 0.212412 0.207060 0.206822 0.207183 0.238250 0.206349 0.209288 0.202684 0.225181 0.204153 0.196996 0.188254 0.205165 0.192849 0.193135 0.192932 0.194954 0.215321 0.209533 0.209600 0.209711 0.209628 0.215668
chargesum: 0.00000
title: Mulliken charges with hydrogens summed into heavy atoms:
elementType: C C C C C C C C C C C C C C C
charge: 0.348057 0.370172 -0.096662 -0.012548 -0.046990 -0.126805 -0.130868 -0.115508 -0.148308 0.001871 0.017863 0.036587 0.035666 -0.066375 -0.066152
polarizability: 1.72609825e+02 3.35386997e+00 1.73343355e+02 -1.91586304e+00 3.95005441e-01 1.43324238e+02
1716.lowfreq: -13.0159 -8.4297 -0.0003 -0.0001 0.0002 7.3138 26.0649 33.4869 45.0354
frequency: 25.5131 33.3376 44.8634 51.1088 58.8817 105.3090 115.7958 135.4197 142.0634 172.1194 201.1226 214.4525 224.8919 227.6601 236.7022 246.1748 255.9845 274.7648 292.0892 303.9442 308.0312 313.2526 320.4491 332.9606 382.8791 417.0089 428.8806 465.0010 470.0648 483.8244 557.8386 721.2275 727.4517 729.8098 767.8600 776.8400 789.5602 851.4436 875.3262 893.7095 894.7044 901.5967 904.8552 920.1739 931.0866 933.7447 954.0854 978.7847 1003.7357 1005.9768 1036.5853 1036.8753 1053.5300 1075.0141 1076.4604 1078.8565 1089.1001 1098.6886 1129.3387 1160.2411 1197.1180 1202.2969 1205.3722 1222.4842 1237.2793 1243.8246 1259.0150 1267.6530 1283.6608 1286.9609 1297.3382 1304.0156 1311.4311 1331.4636 1336.4812 1343.9779 1350.2264 1357.2506 1374.3242 1378.8502 1387.0419 1388.5712 1392.1148 1397.4963 1451.0549 1456.3178 1459.9143 1463.8291 1465.1498 1466.9334 1469.6267 1475.0133 1475.5037 1476.5865 1476.6355 1477.1275 1478.6031 1485.3016 1485.3839 1487.0521 1489.3671 1497.3825 1499.4286 2942.1241 2948.2678 2952.6751 2959.5362 2959.7776 2963.7331 2966.8712 2967.9471 2969.1783 2969.5876 2970.7595 2970.9315 2974.4451 2989.8070 2998.6452 3004.4742 3012.2690 3018.0444 3035.4796 3039.3356 3051.7150 3053.6705 3059.9377 3061.1709 3066.0792 3067.2107 3067.4208 3069.2458 3069.9483 3071.1074 3081.9877 3093.6667
redmass: 2.8929 2.7431 1.5715 1.8135 2.8281 2.6451 2.8428 2.5302 2.3165 1.8970 2.3271 1.4567 1.1463 1.6005 1.3549 1.4597 1.5585 2.0840 1.3730 1.8281 1.3302 2.4737 1.8537 2.3639 1.9801 2.3641 2.1355 2.3181 2.3554 2.8086 2.4558 2.4094 1.1090 1.2421 2.0127 1.2324 1.5906 1.9783 2.1045 1.7411 1.7596 1.6204 1.5289 1.6309 1.4489 1.4132 1.4946 1.6484 1.3941 1.3352 2.8098 2.9528 1.4654 2.2265 2.2906 1.4254 2.0111 1.9967 1.8581 2.4531 2.0481 1.7888 2.3373 2.1407 1.6660 1.7968 1.4542 1.5294 1.1096 1.1202 1.2290 1.2470 1.3603 1.4336 1.5217 1.3606 1.5588 1.5120 1.1993 1.2052 1.2157 1.2144 1.2161 1.2072 1.0745 1.0668 1.0665 1.0647 1.0669 1.0598 1.0653 1.0662 1.0559 1.0468 1.0484 1.0571 1.0629 1.0564 1.0668 1.0791 1.0676 1.0582 1.0605 1.0595 1.0639 1.0629 1.0579 1.0581 1.0358 1.0418 1.0415 1.0519 1.0572 1.0369 1.0372 1.0385 1.0975 1.0969 1.1005 1.0955 1.0957 1.1033 1.1017 1.0989 1.0990 1.0978 1.0975 1.0991 1.1006 1.1004 1.0992 1.0992 1.0987 1.0991 1.0956
irintensity: 0.0005 0.0002 0.0094 0.0027 0.0150 0.0103 0.0569 0.0143 0.0523 0.0283 0.0352 0.2172 0.0069 0.0162 0.0629 0.0444 0.0421 0.0136 0.0810 0.0094 0.0100 0.3567 0.0257 0.0692 0.0070 0.1259 0.5601 0.0359 1.5000 0.7592 0.2063 2.4042 8.4776 8.0770 0.0210 0.1170 0.0888 3.6195 0.6025 4.4778 9.3000 2.1986 3.2876 8.7238 1.1848 0.9327 1.2012 2.4747 0.5339 1.2432 2.0822 1.8606 1.4785 0.6189 0.5816 0.4402 6.3225 11.0197 2.6111 2.5079 0.3918 2.4356 9.8263 8.5348 5.4073 3.3664 7.5716 5.2983 0.7895 0.0990 0.9492 6.3331 6.0614 6.1987 1.9333 8.3059 1.5224 0.3753 15.5769 22.9175 8.7668 16.4606 15.6369 16.6604 0.4143 9.2935 1.8955 0.9588 0.5207 1.3515 4.2262 1.6991 4.1801 19.7798 4.9239 5.1096 8.7946 10.7520 12.6431 6.6200 6.5016 15.1501 29.7928 13.5612 50.0841 5.6070 6.2832 2.5929 24.2233 5.2760 72.0183 146.9600 31.6328 7.4516 78.4972 18.6468 10.4488 1.3770 1.4236 29.4901 8.1942 47.5983 56.9500 47.0818 28.5664 105.7325 13.0202 69.3031 14.0401 156.1105 82.7665 36.6606 62.4410 30.9157 41.3308
temp: 298.150 k
press: 1.00000 atm
elementType: 6 6 6 6 6 6 6 6 6 6 6 6 6 6 6 1 1 1 1 1 1 1 1 1 1 1 1 1 1 1 1 1 1 1 1 1 1 1 1 1 1 1 1 1 1 1 1
symmnumber: 1
zpe: 1142784.0 jmol-1
zpe.correction: 0.435263 hartree
zpe.thermalcorrener: 0.455882 hartree
zpe.thermalcorrenthalpy: 0.456826 hartree
zpe.thermalcorrgfe: 0.386044 hartree
zpe.sumelectzpe: -589.504594 hartree
zpe.sumelectthermal: -589.483975 hartree
zpe.sumelectthermalent: -589.483031 hartree
zpe.sumelectthermalfe: -589.553813 hartree
dipole: 0.0565 0.0070 0.0165
dipole: 0.0593
quadrupole: -99.9986 -102.3473 -100.2942
quadrupole: -0.5802 -0.4433 -0.3134
quadrupole: 0.8815 -1.4673 0.5859 -0.5802 -0.4433 -0.3134
hfenergy: -589.939857 hartree
pointgroup: C01 [X(C15H32)]
dipole: 0.0220967 -0.0053408 -0.0052803 debye
polarizability: 171.2431484|-3.4658007|174.0413599|3.8322711|2.4589173|143.992909 unknown
InChI: InChI=1S/C15H32/c1-7-9-11-14(3,4)13-15(5,6)12-10-8-2/h7-13H2,1-6H3
charge 0 multiplicity 1
47 atoms
C  -1.543252 1.367507 -0.55326
C  0.962395 1.333145 0.661804
C  0.019296 1.202024 -0.591044
C  -2.291536 0.174867 0.134819
C  2.355615 0.72527 0.261841
C  -1.999269 1.451334 -2.042352
C  -2.00137 2.677258 0.143861
C  1.223732 2.828486 1.006201
C  0.441431 0.61804 1.936868
C  -1.999085 -1.248205 -0.393915
C  2.448279 -0.812205 0.122094
C  -2.866774 -2.322541 0.303662
C  3.844344 -1.274507 -0.358479
C  -2.579995 -3.752695 -0.202164
C  3.962975 -2.809346 -0.477157
H  0.395837 1.943405 -1.32887
H  0.209465 0.212925 -1.052384
H  -3.381029 0.367208 0.025448
H  -2.09126 0.193981 1.222948
H  2.673737 1.189957 -0.696431
H  3.099133 1.046574 1.022304
H  -3.103687 1.455084 -2.116766
H  -1.623104 2.379267 -2.513461
H  -1.62009 0.59924 -2.636119
H  -1.487541 3.559691 -0.28104
H  -1.808259 2.656841 1.231788
H  -3.090539 2.82053 0.003424
H  1.660043 3.361857 0.139518
H  0.302906 3.357762 1.301342
H  1.940903 2.908671 1.846219
H  1.23488 0.600766 2.709575
H  -0.427825 1.144946 2.369305
H  0.142994 -0.426093 1.737644
H  -2.181147 -1.298204 -1.486576
H  -0.930435 -1.502632 -0.242012
H  1.686119 -1.186254 -0.592045
H  2.228892 -1.294632 1.095431
H  -3.938398 -2.081038 0.147921
H  -2.695098 -2.274185 1.398784
H  4.614611 -0.895816 0.344597
H  4.064342 -0.806844 -1.339999
H  -3.21223 -4.499894 0.312202
H  -1.522404 -4.02956 -0.030557
H  -2.774868 -3.83576 -1.288312
H  3.225219 -3.209445 -1.19839
H  3.775359 -3.297496 0.498024
H  4.969288 -3.114086 -0.819189
