program: Gaussian 09
title: 000144656
version: EM64L-G09RevD.01
frameworkgroup: C1[X(C14H28O8)]
method: RPBEPBE
basis: SDD
operation: Freq
keyword: #pfreq=noraman
keyword: PBEPBE/SDD
title: #p freq=noraman PBEPBE/SDD
converged: YES YES NO NO
title: Mulliken charges:
elementType: O O O O O O O O C C C C C C C C C C C C C C H H H H H H H H H H H H H H H H H H H H H H H H H H H H
charge: -0.289058 -0.263874 -0.253133 -0.269618 -0.264670 -0.237089 -0.270857 -0.268534 -0.246681 -0.254516 -0.252841 -0.242594 -0.218902 -0.243650 -0.242346 -0.228812 -0.280980 -0.263748 -0.270575 -0.285123 -0.193314 -0.220568 0.172792 0.222642 0.184419 0.195803 0.184898 0.187669 0.171706 0.213199 0.222354 0.174304 0.180263 0.191950 0.173921 0.190347 0.178405 0.201382 0.190904 0.200000 0.157955 0.295012 0.285991 0.168468 0.191804 0.245080 0.154778 0.221425 0.201913 0.202097
chargesum: 0.00000
title: Mulliken charges with hydrogens summed into heavy atoms:
elementType: O O O O O O O O C C C C C C C C C C C C C C
charge: -0.289058 -0.263874 -0.253133 -0.269618 -0.264670 -0.237089 -0.270857 -0.268534 0.148752 0.125707 0.119726 0.142312 0.177756 0.128564 0.121922 0.150975 0.109925 0.180198 0.192905 0.151761 0.182889 0.183442
polarizability: 2.10614305e+02 -1.18441229e+00 1.84242927e+02 -7.65145826e-01 8.65877829e-01 1.57845052e+02
1716.lowfreq: -12.9790 -5.2102 0.0003 0.0006 0.0008 4.8876 11.9375 19.2274 23.2259
frequency: 5.1564 19.1508 22.9981 37.5118 40.8290 48.1838 60.9842 71.1104 78.7857 92.5101 98.0023 115.4375 130.1089 142.8087 158.0422 176.7951 184.5837 197.5182 204.1979 211.0428 236.9822 254.3248 266.0153 282.2882 286.1368 309.8895 321.9844 325.7374 348.0636 383.2014 428.2852 445.4666 480.6009 501.7653 512.0218 536.0034 576.4047 624.5680 769.2556 778.3884 787.1971 791.2176 792.4699 795.4063 800.1367 808.4618 914.0418 923.3304 928.3085 930.4141 947.7072 961.6339 987.9101 1000.7415 1004.7447 1022.8576 1031.3803 1036.7115 1038.2371 1045.0497 1050.3720 1055.3286 1067.0166 1070.0590 1072.9551 1086.8460 1098.7959 1105.7957 1110.8077 1113.7258 1116.2587 1121.9305 1126.6737 1129.7155 1193.9984 1198.2337 1204.1060 1207.5057 1207.6499 1212.8165 1231.0503 1249.5821 1250.9292 1255.7670 1257.7286 1263.5416 1269.0963 1271.4980 1334.6624 1337.7310 1345.2394 1346.4265 1358.2588 1363.2365 1374.1292 1377.5592 1383.8684 1395.8910 1398.8493 1404.1416 1415.2023 1417.6456 1440.7800 1447.6522 1450.0639 1450.2607 1450.7907 1451.5970 1458.4774 1459.9985 1462.5271 1470.1109 1470.5746 1471.6726 1473.9895 1476.1670 2877.9051 2906.3419 2910.7254 2913.4640 2914.1308 2918.6971 2919.9833 2930.7077 2931.1700 2938.9190 2952.2771 2956.0477 2957.5975 2963.1444 2964.4811 2968.3959 2971.7646 2975.5137 2976.7991 2988.8213 2991.8159 2997.3197 3017.7334 3032.4449 3048.0469 3049.2484 3072.6807 3073.4126
redmass: 3.9657 4.7822 4.0737 4.3043 5.5271 4.4599 3.7066 3.8663 3.7976 3.9932 3.9643 4.7942 4.0581 4.1234 4.5646 3.5247 2.5300 2.7983 2.5285 2.6163 2.9381 3.5708 2.7137 2.7289 3.3385 2.1365 2.7899 3.0166 2.4533 2.0017 3.4280 2.7477 2.6779 2.7106 2.8952 2.8353 3.1537 4.3850 3.1111 3.2030 2.2280 2.5881 2.5305 3.1486 2.9377 3.1335 2.4762 2.2263 2.2738 2.0493 3.4879 4.9502 2.5992 2.3773 2.2628 2.8034 2.5364 2.7092 2.7192 2.7102 2.8000 3.3440 3.1011 3.3696 2.7190 2.4799 2.9307 2.9875 2.5711 2.3360 2.5946 2.5449 2.0120 2.1873 1.0953 1.0895 1.0976 1.1297 1.1241 1.1048 1.0924 1.0882 1.1273 1.1317 1.1036 1.1115 1.1169 1.1094 1.2037 1.2103 1.2517 1.2664 1.2437 1.2287 1.3008 1.3181 1.2462 1.3890 1.3006 1.3737 1.5897 1.6081 1.0822 1.0851 1.0865 1.0830 1.0867 1.0875 1.0846 1.0873 1.0858 1.0860 1.0893 1.0839 1.0840 1.0802 1.0673 1.0560 1.0582 1.0596 1.0566 1.0577 1.0557 1.0588 1.0591 1.0669 1.0647 1.0576 1.0575 1.0667 1.0953 1.1050 1.1031 1.1018 1.1045 1.1029 1.0972 1.1001 1.1055 1.1123 1.0997 1.1005 1.0947 1.0934
irintensity: 3.9003 0.5208 0.2971 2.2227 0.4807 2.3580 2.7433 1.7115 12.2405 1.1435 2.8345 5.0322 11.4674 12.6199 2.9401 5.4064 3.9889 4.3463 1.3081 2.2453 13.3286 1.2328 3.0939 0.5727 6.1720 7.1582 5.4250 0.5157 3.3176 11.0124 5.6562 24.1857 0.8912 5.8867 0.8521 0.0705 1.7959 2.9882 5.1866 1.2917 2.6843 21.3560 16.2666 4.5676 19.5845 28.7672 4.0395 6.3371 74.2711 18.8821 123.8929 337.8813 20.0954 66.1333 33.8634 65.3927 17.5315 7.9839 20.7808 48.4221 34.1943 245.8341 118.0981 60.3288 66.0256 17.6825 70.8036 11.0805 27.7799 6.7832 57.6937 28.7967 5.8728 9.0691 4.5536 1.2375 10.1154 3.0741 13.2189 18.5648 7.6272 20.3267 2.4605 2.1695 1.8296 19.0466 5.3117 5.5756 14.9517 69.8492 23.5135 2.8026 5.1791 3.4276 1.4758 1.8267 7.5075 11.7998 3.7652 4.2080 1.1606 0.7012 1.7977 2.3425 21.4178 20.0931 7.9219 2.8976 7.7327 16.5567 9.6821 1.6266 11.3928 2.1943 15.4608 7.9472 97.3554 13.8175 20.6222 33.1080 11.1755 66.7301 47.2698 269.5781 6.6902 78.2448 73.5128 88.6296 82.6987 201.3734 87.3990 11.8657 94.3715 73.8672 12.9729 60.2861 73.0613 39.4426 58.9415 46.6786 16.8349 21.0432 45.8225 17.2205
temp: 298.150 k
press: 1.00000 atm
elementType: 8 8 8 8 8 8 8 8 6 6 6 6 6 6 6 6 6 6 6 6 6 6 1 1 1 1 1 1 1 1 1 1 1 1 1 1 1 1 1 1 1 1 1 1 1 1 1 1 1 1
symmnumber: 1
zpe: 1104858.8 jmol-1
zpe.correction: 0.420819 hartree
zpe.thermalcorrener: 0.446241 hartree
zpe.thermalcorrenthalpy: 0.447185 hartree
zpe.thermalcorrgfe: 0.360300 hartree
zpe.sumelectzpe: -1150.101563 hartree
zpe.sumelectthermal: -1150.076140 hartree
zpe.sumelectthermalent: -1150.075196 hartree
zpe.sumelectthermalfe: -1150.162081 hartree
dipole: 0.3780 -2.3226 1.6212
dipole: 2.8575
quadrupole: -120.6832 -120.8434 -121.5035
quadrupole: -12.6509 5.9958 2.2870
quadrupole: 0.3268 0.1666 -0.4934 -12.6509 5.9958 2.2870
hfenergy: -1150.5223811 hartree
pointgroup: C01 [X(C14H28O8)]
dipole: 0.0141685 0.8964273 -0.678335 debye
polarizability: 209.6405856|5.1110754|185.2381294|0.8452755|-0.2052855|157.8235684 unknown
InChI: InChI=1S/C14H28O8/c1-2-16-6-10-20-14-22-12-8-18-4-3-17-7-11-21-13-19-9-5-15-1/h1-14H2
charge 0 multiplicity 1
50 atoms
O  2.473755 2.29993 0.154481
O  -0.50354 1.898486 -0.574525
O  0.595143 -2.284743 -0.234333
O  -2.237037 -2.09468 0.567915
O  4.449176 0.059647 1.128495
O  3.541901 -1.701209 -0.254564
O  -3.469169 1.498598 -0.262662
O  -4.668258 -0.534512 0.345704
C  1.299522 3.108392 0.505546
C  0.320794 3.104614 -0.660324
C  -0.456263 -3.230826 -0.599278
C  -1.437084 -3.321057 0.560506
C  3.483279 2.32209 1.220091
C  -1.506018 1.831919 -1.644195
C  1.404389 -1.883591 -1.385303
C  -3.295646 -2.108734 1.577364
C  4.673688 1.471124 0.788346
C  2.479163 -0.917784 -0.917337
C  -2.584913 0.83442 -1.249756
C  -3.928158 -0.724603 1.60884
C  4.705685 -0.935736 0.086193
C  -4.750951 0.850974 -0.087628
H  1.622793 4.153005 0.719407
H  0.795676 2.699514 1.406587
H  -0.332205 4.004918 -0.5999
H  0.886082 3.14447 -1.617875
H  -0.018972 -4.23436 -0.805828
H  -1.002547 -2.891012 -1.507933
H  -2.093973 -4.210608 0.425555
H  -0.879522 -3.429173 1.515869
H  3.067067 1.91886 2.167586
H  3.815871 3.371743 1.396783
H  -1.020916 1.509667 -2.593574
H  -1.971792 2.829013 -1.806492
H  0.757929 -1.371912 -2.135408
H  1.874521 -2.769937 -1.867428
H  -2.876285 -2.340998 2.583052
H  -4.060042 -2.877292 1.326679
H  4.837253 1.603759 -0.301805
H  5.580022 1.81304 1.328323
H  2.91058 -0.385949 -1.796187
H  -2.146588 -0.078641 -0.806037
H  2.057795 -0.165529 -0.228332
H  -3.180471 0.550999 -2.145399
H  -4.630956 -0.647043 2.465385
H  -3.138415 0.044024 1.704673
H  5.127806 -0.420276 -0.81162
H  5.410762 -1.679004 0.494074
H  -5.271308 1.488617 0.654656
H  -5.318422 0.788083 -1.038288
