program: Gaussian 09
title: 000144559
version: EM64L-G09RevD.01
frameworkgroup: C1[X(C11H16)]
method: RPBEPBE
basis: SDD
operation: Freq
keyword: #p
keyword: freq=noraman
keyword: PBEPBE/SDD
title: #p freq=noraman PBEPBE/SDD
converged: YES YES NO NO
title: Mulliken charges:
elementType: C C C C C C C C C C C H H H H H H H H H H H H H H H H
charge: -0.278126 -0.292131 -0.498754 -0.470440 -0.486362 0.638943 0.647916 -0.583930 -0.590214 -0.816099 -0.817934 0.219238 0.222630 0.233695 0.211640 0.228125 0.225021 0.222816 0.224555 0.215116 0.221446 0.215486 0.216935 0.222957 0.220447 0.224834 0.222189
chargesum: 0.00000
title: Mulliken charges with hydrogens summed into heavy atoms:
elementType: C C C C C C C C C C C
charge: -0.058889 -0.069501 -0.053419 -0.017294 -0.038990 0.638943 0.647916 -0.147368 -0.157793 -0.372695 -0.370910
polarizability: 1.44108047e+02 3.23496783e+00 1.08603999e+02 -5.39876208e+00 1.21200876e+00 8.48705323e+01
1716.lowfreq: -11.1283 -0.0006 -0.0003 0.0005 8.0207 24.5564 77.1340 99.0668 174.0597
frequency: 76.8738 98.9092 174.0548 206.4218 248.7405 296.1266 325.2720 358.9993 391.7828 423.6289 466.0640 558.7780 658.5018 664.8271 685.9486 715.8022 734.0979 735.9933 778.0259 798.5079 850.9468 872.2634 890.7143 928.2850 936.6100 943.4170 968.9461 981.5338 985.0584 996.7204 1015.7529 1048.6060 1073.8872 1083.2142 1132.7966 1150.7514 1168.5274 1179.8104 1193.7794 1219.7063 1234.8224 1280.1693 1295.1293 1300.9215 1301.9869 1306.2678 1316.6865 1324.5910 1328.3618 1342.5137 1434.8517 1439.3754 1455.6219 1469.0570 1471.6057 1479.2891 1495.4465 1649.1027 1652.5226 2961.5824 2980.1747 2987.0577 2992.7949 3005.5491 3012.7290 3026.1717 3032.2410 3039.8960 3049.2574 3061.9656 3074.7219 3081.1131 3081.3574 3182.0193 3182.8049
redmass: 3.1084 2.4919 2.2857 2.3360 2.6909 2.7325 3.3393 2.5252 2.4748 2.1346 2.0001 3.2894 2.8272 2.8582 1.7718 1.2357 2.0970 1.4927 2.2334 2.3468 2.0138 2.0596 2.3274 1.9843 1.3692 1.3644 2.4798 1.6261 1.9276 1.7898 1.9015 2.4088 2.3016 1.9764 1.2497 1.2858 1.2617 1.3661 1.2765 1.2525 1.2277 1.3443 1.5192 1.3293 1.4481 1.4515 1.6779 1.3374 1.8471 1.9435 1.1817 1.1715 1.1050 1.0934 1.0841 1.0897 1.0873 5.0924 5.1048 1.0645 1.0607 1.0666 1.0634 1.0671 1.0819 1.0807 1.0981 1.0979 1.1025 1.1005 1.1040 1.0623 1.0622 1.1136 1.1135
irintensity: 0.0246 0.0764 0.1049 0.5947 1.7188 0.4132 0.1593 1.0702 0.0597 0.0490 2.6770 1.8086 4.6508 9.9281 0.2928 0.3314 1.5765 0.7878 2.1306 1.2584 4.9141 6.5037 7.0805 1.9499 24.7248 126.0117 4.7632 2.9952 3.4123 6.8672 3.0214 0.3888 1.1543 0.1507 9.4673 0.1583 0.9912 1.0627 1.3119 0.6942 0.1952 0.6559 1.4821 0.3561 0.3118 3.0143 1.8438 3.5698 1.7909 0.3947 2.6123 7.7162 15.6403 13.2156 10.4526 19.2172 11.0044 20.4887 43.4293 15.6855 26.1956 15.5348 6.7843 56.6688 62.6123 67.5869 26.2769 35.4384 2.3468 21.8015 64.9635 17.5246 4.3424 15.4451 33.9641
temp: 298.150 k
press: 1.00000 atm
elementType: 6 6 6 6 6 6 6 6 6 6 6 1 1 1 1 1 1 1 1 1 1 1 1 1 1 1 1
symmnumber: 1
zpe: 630123.6 jmol-1
zpe.correction: 0.240001 hartree
zpe.thermalcorrener: 0.249910 hartree
zpe.thermalcorrenthalpy: 0.250855 hartree
zpe.thermalcorrgfe: 0.205308 hartree
zpe.sumelectzpe: -427.880785 hartree
zpe.sumelectthermal: -427.870876 hartree
zpe.sumelectthermalent: -427.869932 hartree
zpe.sumelectthermalfe: -427.915478 hartree
dipole: -0.0130 0.5344 -0.0515
dipole: 0.5370
quadrupole: -70.6540 -64.2303 -69.6053
quadrupole: 0.3243 -0.9956 1.9741
quadrupole: -2.4908 3.9329 -1.4421 0.3243 -0.9956 1.9741
hfenergy: -428.1207861 hartree
pointgroup: C01 [X(C11H16)]
dipole: -0.0040962 0.2103004 -0.0198258 debye
polarizability: 144.0762583|3.063699|108.5658311|-5.7334932|1.2675429|84.9404887 unknown
InChI: InChI=1S/C11H16/c1-8-3-4-9(2)11-6-5-10(8)7-11/h10-11H,1-7H2
charge 0 multiplicity 1
27 atoms
C  1.198802 0.855948 0.436258
C  -1.285255 0.883206 0.373971
C  -0.063195 0.925761 1.343394
C  0.75805 1.62228 -0.874221
C  -0.794594 1.777631 -0.811551
C  1.685203 -0.566823 0.143211
C  -1.660165 -0.532306 -0.056343
C  0.659968 -1.689821 0.013121
C  -0.627082 -1.363395 -0.809826
C  3.014133 -0.824245 0.004145
C  -2.885792 -1.047091 0.23542
H  2.039488 1.397282 0.90854
H  -2.172727 1.335419 0.855219
H  -0.093997 0.133817 2.112574
H  -0.074182 1.899883 1.870731
H  1.08595 1.067934 -1.770929
H  1.251364 2.610398 -0.915558
H  -1.063323 2.829077 -0.598631
H  -1.286893 1.504577 -1.762184
H  1.157823 -2.567023 -0.441774
H  0.333766 -2.009019 1.025003
H  -1.096656 -2.321424 -1.10165
H  -0.333737 -0.856634 -1.750964
H  3.769031 -0.039539 0.137756
H  3.386973 -1.824991 -0.245286
H  -3.63911 -0.46575 0.781294
H  -3.172547 -2.062651 -0.063523
