program: Gaussian 09
title: 000144555
version: EM64L-G09RevD.01
frameworkgroup: C1[X(C10H9BrO)]
method: RPBEPBE
basis: SDD
operation: Freq
keyword: #p
keyword: freq=noraman
keyword: PBEPBE/SDD
title: #p freq=noraman PBEPBE/SDD
converged: YES YES NO NO
title: Mulliken charges:
elementType: Br O C C C C C C C C C C H H H H H H H H H
charge: 0.024629 -0.226046 0.552312 -0.381973 -0.366279 -0.230359 -0.193367 -0.242007 -0.226801 -0.290205 0.180946 -0.785578 0.231879 0.277962 0.254593 0.236028 0.241040 0.216315 0.234191 0.257381 0.235337
chargesum: 0.00000
title: Mulliken charges with hydrogens summed into heavy atoms:
elementType: Br O C C C C C C C C C C
charge: 0.024629 -0.226046 0.552312 -0.381973 -0.134401 0.047603 0.061227 -0.005979 0.014240 -0.073890 0.180946 -0.058667
polarizability: 2.08626776e+02 1.37392441e+01 1.56577469e+02 -1.57153188e-02 1.25931438e-01 5.23845208e+01
1716.lowfreq: -6.6793 -3.5561 0.0003 0.0005 0.0005 2.5269 18.2995 72.9268 76.1069
frequency: 18.1048 72.9264 76.1045 88.1363 122.6047 149.9541 184.5655 223.4367 282.6004 307.0470 340.8260 442.3714 483.9473 505.1013 546.9378 574.7827 613.8785 655.9534 721.0122 762.5890 821.5820 864.3087 878.4281 909.4670 955.3373 957.7593 990.1891 1003.1882 1015.6056 1033.0204 1043.6997 1113.6529 1174.0622 1182.5853 1218.2298 1282.5596 1298.0831 1316.5944 1367.1557 1372.0179 1423.3691 1441.8934 1455.5241 1455.6625 1560.4529 1566.0412 1595.9728 1645.6627 2977.4958 3059.4938 3113.5534 3122.2965 3125.7137 3137.7881 3149.9857 3164.2489 3177.4208
redmass: 3.9583 7.5478 3.1834 1.1701 2.7739 4.1220 5.3304 7.8517 3.3830 10.4265 3.8294 2.9161 3.6531 3.2379 5.9453 2.7630 5.4170 6.4458 3.1157 1.2833 5.1273 1.3651 1.8002 3.3359 1.3813 1.8769 1.3494 7.1677 1.3475 1.5200 2.1156 1.8164 1.1016 2.2046 1.4333 1.6446 2.0333 1.4929 1.4068 3.7570 2.2752 1.0948 1.0655 2.4103 5.6131 7.1127 6.5445 5.7400 1.0378 1.0964 1.0941 1.0868 1.0982 1.0854 1.0901 1.0954 1.0999
irintensity: 4.7234 0.7516 0.0888 0.0758 0.6150 0.0006 2.0196 1.4250 2.9188 4.5057 2.0059 11.3948 8.5436 0.0454 32.2620 0.3219 0.1969 19.2125 1.7081 85.3345 0.5427 0.9963 3.1625 7.5827 0.0676 44.2380 1.3985 60.9240 46.0496 4.5261 1.8876 5.3398 1.9608 132.0461 4.5478 20.0250 118.3090 9.0910 40.1159 65.8031 40.7439 33.8328 21.2257 37.2068 11.7729 245.3498 4.5461 103.7786 3.3338 14.9359 7.9201 1.9322 23.6468 0.2489 5.5372 16.2648 15.5404
temp: 298.150 k
press: 1.00000 atm
elementType: 35 8 6 6 6 6 6 6 6 6 6 6 1 1 1 1 1 1 1 1 1
symmnumber: 1
zpe: 413566.9 jmol-1
zpe.correction: 0.157519 hartree
zpe.thermalcorrener: 0.169494 hartree
zpe.thermalcorrenthalpy: 0.170439 hartree
zpe.thermalcorrgfe: 0.116528 hartree
zpe.sumelectzpe: -474.274273 hartree
zpe.sumelectthermal: -474.262298 hartree
zpe.sumelectthermalent: -474.261354 hartree
zpe.sumelectthermalfe: -474.315265 hartree
dipole: 1.3367 5.0977 0.0469
dipole: 5.2702
quadrupole: -70.5775 -74.7245 -83.4013
quadrupole: -7.4037 -0.1837 -0.0553
quadrupole: 5.6569 1.5099 -7.1668 -7.4037 -0.1837 -0.0553
hfenergy: -474.4317922 hartree
pointgroup: C01 [X(C10H9Br1O1)]
dipole: -1.0456995 1.6590482 -0.6732784 debye
dipolederiv: -0.0272994 0.1222522 -0.0535328 0.0172898 -0.5513629 0.2321278 -0.0070087 0.224353 -0.119519 -0.9115638 0.037188 0.0296977 0.4953268 -0.6748494 0.1301171 -0.1781318 0.1647804 -0.3759117 -0.2173018 0.1028403 -0.024158 0.0857113 -0.2912077 0.1494261 -0.0190564 0.1474028 -0.0018516 0.0954267 -0.340516 0.1318972 0.0819918 0.984976 -0.5042663 -0.0563363 -0.4716843 0.0670583 0.010162 -0.0273695 0.0033756 -0.0680466 0.0015543 -0.0478685 0.0233918 -0.0512256 -0.1001945 0.7476461 0.0412149 -0.0802118 0.0201227 0.0409304 -0.0425328 -0.0714124 -0.0435432 -0.0219922 -0.0707601 0.1982398 -0.0880469 0.2419933 -0.3059994 0.0796854 -0.1072308 0.0831402 -0.1113034 -0.1919694 -0.0877174 0.0418932 -0.1305804 0.0437613 -0.0754946 0.059778 -0.0789262 -0.1209659 0.0443841 0.0296586 -0.0267445 -0.008953 0.0715755 -0.0932713 -0.0099785 -0.0957716 -0.0987097 -1.4594165 -0.0891919 0.1373738 -0.2408716 0.0142852 -0.0882604 0.2067281 -0.0987363 -0.1897697 2.1064196 0.1670652 -0.2338881 -0.3321893 0.7013848 -0.2426729 -0.0120361 -0.2815709 0.2588571 -0.3441451 -0.2139387 0.1317223 -0.3519028 -0.2262752 0.1607993 0.2037965 0.1532396 -0.0339633 0.0171961 -0.0854143 0.0463071 -0.0633628 0.0079537 0.063214 0.0369603 0.0650537 0.1099437 0.1073351 0.0249483 -0.0079617 0.047418 0.0458018 0.0422601 -0.0165236 0.0434517 0.1280087 0.0225886 -0.0560726 0.035145 -0.0784026 0.0422847 0.0578752 0.0450541 0.056033 0.1322277 0.0605448 0.0457722 -0.0124132 0.0751148 -0.0541697 0.0897484 -0.0256532 0.0918138 0.124638 -0.0913833 0.0506254 -0.0030902 0.0456369 0.074799 0.0356998 -0.0008112 0.0353677 0.1482429 0.0710663 0.0434236 -0.012755 0.0413758 -0.062274 0.0980985 -0.0113046 0.0975266 0.1155268 0.0722723 0.0249544 0.0519266 0.0136166 -0.0473177 -0.089089 0.0034718 -0.1034543 0.061771 -0.1038546 0.0300263 0.0006315 0.098557 0.0709066 0.0180818 -0.033492 0.0213585 0.1151576 0.0626523 -0.0179889 -0.0671677 0.0101544 0.1132426 0.0263222 -0.0302051 0.0413914 -0.0872508 unknown
polarizability: 211.1758608|-2.9633638|136.6480025|-11.0281827|-37.1986034|69.7649021 unknown
InChI: InChI=1S/C10H9BrO/c1-8(12)6-7-9-4-2-3-5-10(9)11/h2-7H,1H3
charge 0 multiplicity 1
21 atoms
Br -1.262182 -2.750072 1.205591
O  3.453892 -1.274586 0.21136
C  -0.716738 -0.089223 -0.006708
C  -1.724498 -0.986049 0.463806
C  -1.175298 1.163364 -0.523054
C  0.710799 -0.427947 0.035392
C  -3.096489 -0.663982 0.424941
C  -2.538192 1.499779 -0.569061
C  -3.506669 0.583501 -0.093498
C  1.759004 0.341442 -0.39647
C  3.165487 -0.144279 -0.28601
C  4.24706 0.795283 -0.808605
H  -0.434485 1.879849 -0.892337
H  0.982542 -1.405101 0.457285
H  -3.835911 -1.379163 0.795562
H  -2.849307 2.469132 -0.971853
H  -4.572499 0.832475 -0.122965
H  1.615588 1.335675 -0.838931
H  4.202448 1.769501 -0.285034
H  5.240894 0.346471 -0.661268
H  4.094051 0.99883 -1.886044
