program: Gaussian 09
title: 000144553
version: EM64L-G09RevD.01
frameworkgroup: C1[X(C10H16S3)]
method: RPBEPBE
basis: SDD
operation: Freq
keyword: #pfreq=noraman
keyword: PBEPBE/SDD
title: #p freq=noraman PBEPBE/SDD
converged: YES YES NO NO
title: Mulliken charges:
elementType: S S S C C C C C C C C C C H H H H H H H H H H H H H H H H
charge: 0.171469 0.049677 0.049682 0.241288 0.241252 -0.094655 -0.094490 -0.749339 -0.749345 -0.677166 -0.717520 -0.677155 -0.717471 0.257189 0.255226 0.255228 0.257193 0.208878 0.224604 0.237442 0.236100 0.220830 0.221636 0.224592 0.208874 0.237446 0.220820 0.236092 0.221625
chargesum: 0.00000
title: Mulliken charges with hydrogens summed into heavy atoms:
elementType: S S S C C C C C C C C C C
charge: 0.171469 0.049677 0.049682 0.241288 0.241252 -0.094655 -0.094490 -0.236923 -0.236924 -0.006242 -0.038955 -0.006244 -0.038934
polarizability: 1.89681682e+02 -6.92724409e-03 1.60164508e+02 -5.93234386e-03 -1.93842991e+00 1.05422383e+02
1716.lowfreq: -12.3559 -0.0020 -0.0011 0.0012 6.8656 15.4632 43.1417 98.7944 134.0068
frequency: 42.7700 98.7784 134.0038 138.1809 191.0931 196.3876 206.6967 217.1930 228.6941 240.7339 255.1845 261.2732 267.6817 281.8882 314.6025 327.8630 338.2070 352.9134 424.6876 440.9685 471.4817 477.7784 479.9333 519.3633 584.6817 689.5800 701.0557 738.2846 785.3246 794.0534 872.0796 888.6948 913.9082 928.1492 929.2881 943.5903 957.9105 996.8335 1002.5722 1011.5814 1111.8249 1125.6633 1160.3248 1161.6954 1213.1668 1215.2797 1255.1729 1270.0077 1282.8597 1282.8921 1368.7862 1371.7915 1388.4086 1391.6222 1416.2816 1426.3775 1452.3353 1454.4370 1460.2681 1463.0918 1475.8525 1477.2697 1477.8596 1481.3411 1622.9468 2965.4465 2966.2654 2978.7607 2979.5384 3002.9909 3007.7486 3055.5153 3056.9600 3074.9190 3075.7845 3079.1810 3079.3269 3087.4787 3087.6879 3097.3248 3098.5435
redmass: 4.3088 6.8881 2.6233 3.3595 1.4614 1.5444 6.3281 3.6461 1.7809 1.8351 1.2748 1.1088 2.3080 2.4798 3.2750 4.7014 3.0309 2.1227 18.9667 4.3512 3.8401 2.6759 3.9718 3.4710 6.5274 5.5304 4.4556 5.3462 3.9894 2.1879 2.3434 2.7716 1.8110 1.4825 1.5106 1.9554 1.8946 1.3917 1.3338 2.0922 1.7239 2.3269 1.9078 1.7945 2.7819 2.8532 1.3727 1.5354 1.3511 1.9713 1.1808 1.1807 1.1825 1.1870 1.0911 1.0887 1.0497 1.0502 1.0502 1.0505 1.0525 1.0606 1.0489 1.0587 10.8090 1.0373 1.0371 1.0360 1.0361 1.0580 1.0580 1.0963 1.0963 1.0999 1.1001 1.1045 1.1037 1.1009 1.1008 1.0999 1.0995
irintensity: 1.2930 0.1719 0.3068 0.7297 0.0663 0.6677 0.0130 0.0418 0.7486 1.5841 0.1378 0.4213 0.0517 0.2337 0.8696 0.2117 1.5183 0.5082 0.2974 1.3687 3.0250 0.0037 6.7162 4.3585 1.6799 1.6070 8.4853 3.9563 1.6092 1.2195 0.8625 22.0782 35.5075 0.3939 1.3297 6.1346 8.3247 0.0341 4.1976 11.7501 0.3670 6.5291 7.9724 3.6778 1.9396 4.5382 7.8521 0.9520 1.8993 6.9176 4.8594 40.9846 35.3375 13.7503 7.2083 11.2780 3.4817 4.0852 1.5469 12.2721 34.4927 0.0430 2.8594 35.8742 3.3533 9.4084 17.6787 28.8552 34.1063 33.8353 16.3882 21.5183 49.7145 10.3744 37.0631 9.4548 15.8188 19.3925 45.8720 22.5031 8.2463
temp: 298.150 k
press: 1.00000 atm
elementType: 16 16 16 6 6 6 6 6 6 6 6 6 6 1 1 1 1 1 1 1 1 1 1 1 1 1 1 1 1
symmnumber: 1
zpe: 616955.9 jmol-1
zpe.correction: 0.234986 hartree
zpe.thermalcorrener: 0.250238 hartree
zpe.thermalcorrenthalpy: 0.251182 hartree
zpe.thermalcorrgfe: 0.193984 hartree
zpe.sumelectzpe: -1583.788185 hartree
zpe.sumelectthermal: -1583.772933 hartree
zpe.sumelectthermalent: -1583.771989 hartree
zpe.sumelectthermalfe: -1583.829187 hartree
dipole: 0.0000 -1.2458 -0.7580
dipole: 1.4583
quadrupole: -90.8818 -113.0476 -103.4493
quadrupole: -0.0052 0.0003 1.7151
quadrupole: 11.5778 -10.5880 -0.9897 -0.0052 0.0003 1.7151
hfenergy: -1584.023171 hartree
pointgroup: C01 [X(C10H16S3)]
dipole: 0.0001239 0.4919174 0.2952943 debye
polarizability: 189.6816825|-0.0007912|160.1394239|0.0094263|-2.2649372|105.4474661 unknown
InChI: InChI=1S/C10H16S3/c1-9(2)5-11-6-10(3,4)8-7(9)12-13-8/h5-6H2,1-4H3
charge 0 multiplicity 1
29 atoms
S  0.000038 2.583371 -0.044183
S  1.160594 -2.578684 0.001075
S  -1.160739 -2.578597 0.000232
C  1.801169 0.271372 -0.028484
C  -1.801162 0.271486 -0.028469
C  0.686245 -0.763033 0.060638
C  -0.686313 -0.762996 0.060659
C  1.431362 1.599237 0.68532
C  -1.431293 1.5993 0.685383
C  2.146271 0.526524 -1.526042
C  3.067496 -0.276715 0.697023
C  -2.146098 0.526731 -1.526043
C  -3.067601 -0.276529 0.696904
H  1.197621 1.416724 1.749774
H  2.291715 2.289901 0.630176
H  -2.291617 2.290004 0.630285
H  -1.197518 1.416741 1.749821
H  3.008223 1.215686 -1.609849
H  2.407221 -0.421997 -2.027872
H  1.287579 0.977747 -2.051433
H  2.870581 -0.474599 1.765448
H  3.416192 -1.21956 0.231775
H  3.895471 0.4513 0.615838
H  -2.407045 -0.421752 -2.027945
H  -3.008007 1.21594 -1.609894
H  -1.287333 0.977939 -2.051328
H  -3.416311 -1.219344 0.231603
H  -2.870814 -0.474431 1.76535
H  -3.895526 0.451534 0.615641
