program: Gaussian 09
title: 000144542
version: EM64L-G09RevD.01
frameworkgroup: C1[X(C10H16N2)]
method: RPBEPBE
basis: SDD
operation: Freq
keyword: #pfreq=noraman
keyword: PBEPBE/SDD
title: #p freq=noraman PBEPBE/SDD
converged: NO YES NO NO
title: Mulliken charges:
elementType: N N C C C C C C C C C C H H H H H H H H H H H H H H H H
charge: -0.094586 -0.094586 -0.138092 -0.138091 -0.457405 -0.419186 -0.419188 -0.457402 -0.358304 -0.358303 -0.210756 -0.210754 0.221989 0.221989 0.198490 0.229792 0.217476 0.196895 0.217476 0.196896 0.198490 0.229790 0.197862 0.205941 0.197862 0.205942 0.209883 0.209882
chargesum: 0.00000
title: Mulliken charges with hydrogens summed into heavy atoms:
elementType: N N C C C C C C C C C C
charge: -0.094586 -0.094586 0.083897 0.083898 -0.029123 -0.004815 -0.004816 -0.029122 0.045499 0.045500 -0.000873 -0.000873
polarizability: 1.24795796e+02 -1.10470039e-05 1.18880363e+02 -7.92652826e-06 3.30755359e-01 9.03232792e+01
1716.lowfreq: -12.6049 -11.5950 0.0007 0.0007 0.0008 1.8056 110.8549 134.5589 221.4358
frequency: 110.8495 134.5499 221.4131 232.5478 260.4373 324.2770 326.5101 387.3110 420.5213 452.4326 477.9564 490.2143 562.9668 640.5536 642.5053 671.9982 701.8300 761.7830 801.6428 841.4765 845.3730 876.8380 914.8822 915.5509 918.2336 947.8209 960.8808 991.1995 995.5940 1012.6807 1036.6568 1041.9347 1050.6443 1058.5974 1098.9716 1108.5135 1131.6307 1151.4195 1170.4684 1202.1005 1202.5535 1214.9123 1218.6837 1231.3500 1249.4197 1266.1966 1298.0952 1302.5207 1320.0001 1323.9604 1327.7447 1330.0945 1334.8984 1358.6794 1372.8474 1440.5497 1443.3745 1451.4888 1454.8320 1461.9921 1475.4027 1673.4469 2854.7047 2858.9077 2987.0374 2987.2121 2998.8751 3000.6460 3001.9459 3002.2812 3023.9939 3029.6270 3045.8329 3046.2763 3066.8098 3073.1120 3107.6548 3139.1189
redmass: 2.5900 3.3144 1.9517 2.0190 1.7075 2.6285 3.7486 2.1869 3.2403 3.6825 3.9531 3.7462 3.5227 5.1855 1.1406 5.3238 3.9233 1.4887 2.0335 2.5268 1.9867 2.5161 3.2481 3.3540 1.8612 1.1689 2.1875 2.0217 2.5995 2.8764 1.8355 2.2736 2.0248 1.8037 2.7363 2.2831 1.0312 2.4509 1.0667 1.1949 1.7215 1.1768 1.2697 1.2410 1.2837 1.6974 1.5986 1.3634 1.3805 1.4780 1.5485 1.5824 1.4029 1.4729 1.7196 1.0837 1.0968 1.0790 1.0855 1.0918 1.0974 6.6578 1.0697 1.0681 1.0597 1.0602 1.0664 1.0635 1.0845 1.0863 1.0854 1.0884 1.0993 1.1023 1.1026 1.1034 1.0843 1.1006
irintensity: 0.7514 0.8836 0.3823 1.9866 0.6407 0.1623 3.0890 0.0004 6.4308 1.5707 5.0067 0.0000 0.0818 0.1497 49.7262 0.1778 1.0413 1.0729 1.1423 4.6125 6.1878 5.5829 0.9108 20.3198 0.1247 0.0033 9.1934 1.4569 6.3241 4.7506 1.9902 3.4227 6.2810 2.6921 49.4404 11.5298 1.9293 7.9466 5.5492 1.2715 11.9666 1.6485 1.9499 6.0677 5.3170 4.1400 17.1606 0.4526 0.8339 2.2144 3.1908 0.6106 2.3920 0.2990 0.7951 3.3241 3.9696 0.0007 7.0736 25.9018 12.3226 6.1233 3.3529 165.6622 17.3459 40.9836 35.7479 52.9572 13.9133 46.9724 124.7781 3.3351 25.7224 2.5080 54.4941 70.2114 9.0787 55.8828
temp: 298.150 k
press: 1.00000 atm
elementType: 7 7 6 6 6 6 6 6 6 6 6 6 1 1 1 1 1 1 1 1 1 1 1 1 1 1 1 1
symmnumber: 1
zpe: 645210.9 jmol-1
zpe.correction: 0.245748 hartree
zpe.thermalcorrener: 0.255474 hartree
zpe.thermalcorrenthalpy: 0.256418 hartree
zpe.thermalcorrgfe: 0.211545 hartree
zpe.sumelectzpe: -499.156692 hartree
zpe.sumelectthermal: -499.146965 hartree
zpe.sumelectthermalent: -499.146021 hartree
zpe.sumelectthermalfe: -499.190895 hartree
dipole: -0.8201 0.0000 0.0000
dipole: 0.8201
quadrupole: -69.4752 -66.9592 -76.7850
quadrupole: 0.0000 0.0000 -0.5839
quadrupole: 1.5979 4.1139 -5.7118 0.0000 0.0000 -0.5839
hfenergy: -499.4024396 hartree
pointgroup: C01 [X(C10H16N2)]
dipole: 0.3226381 0.0000047 0.0000027 debye
polarizability: 124.7957964|0.000086|118.8166622|0.0006123|-1.387243|90.3869798 unknown
InChI: InChI=1S/C10H16N2/c1-2-8-12-10-5-3-9(4-6-10)11(12)7-1/h1-2,9-10H,3-8H2
charge 0 multiplicity 1
28 atoms
N  -0.348159 -0.609737 -0.453869
N  -0.348184 0.609745 0.453889
C  1.031001 -1.197919 -0.437438
C  1.030972 1.197949 0.437499
C  1.655506 -1.173799 0.989907
C  1.880075 -0.320661 -1.391334
C  1.880024 0.320707 1.391421
C  1.65551 1.173835 -0.989834
C  -1.446123 -1.478204 0.029184
C  -1.446148 1.478193 -0.029209
C  -2.736809 -0.677783 0.036195
C  -2.736816 0.677742 -0.036269
H  0.947971 -2.231893 -0.820692
H  0.947916 2.231924 0.820745
H  2.603775 -1.743522 0.999092
H  0.969341 -1.664522 1.704174
H  1.562134 -0.493434 -2.43443
H  2.946001 -0.607003 -1.304554
H  1.562032 0.493463 2.434505
H  2.945949 0.60707 1.304695
H  2.603759 1.743591 -0.999013
H  0.969333 1.664536 -1.704107
H  -1.259783 -1.896071 1.050726
H  -1.533647 -2.330953 -0.673507
H  -1.25978 1.896055 -1.050746
H  -1.533718 2.330937 0.673479
H  -3.679362 -1.238801 0.079463
H  -3.679372 1.238753 -0.079573
