program: Gaussian 09
title: 000144540
version: EM64L-G09RevD.01
frameworkgroup: C1[X(C12H9FN4O2)]
method: RPBEPBE
basis: SDD
operation: Freq
keyword: #p
keyword: freq=noraman
keyword: PBEPBE/SDD
title: #p freq=noraman PBEPBE/SDD
converged: NO NO NO NO
title: Mulliken charges:
elementType: F O O N N N N C C C C C C C C C C C C H H H H H H H H H
charge: -0.189618 -0.211869 -0.209992 -0.180037 -0.231255 0.104440 -0.085875 0.332085 0.173703 -0.137760 0.060560 0.181808 -0.667281 -0.292283 -0.497010 0.028378 -0.378576 0.367336 -0.598205 0.244575 0.244604 0.326520 0.267323 0.305520 0.268387 0.254304 0.265938 0.254280
chargesum: 0.00000
title: Mulliken charges with hydrogens summed into heavy atoms:
elementType: F O O N N N N C C C C C C C C C C C C
charge: -0.189618 -0.211869 -0.209992 -0.180037 -0.231255 0.104440 -0.085875 0.332085 0.173703 -0.137760 0.060560 0.181808 0.148418 -0.024960 -0.191490 0.028378 -0.110189 0.367336 0.176318
polarizability: 3.26740525e+02 -2.77754117e+00 1.71801939e+02 8.02935862e-03 -9.31662763e-04 7.10079625e+01
1716.lowfreq: -8.2361 -0.0011 -0.0006 -0.0005 6.8116 7.0059 40.7055 65.2753 84.1344
frequency: 40.6662 65.2575 84.1205 102.5763 107.3666 151.2818 159.5971 213.0092 236.6759 254.1396 277.3463 307.5187 308.1340 328.8291 347.7904 383.1348 391.0696 404.3870 440.9457 482.1670 492.2029 500.6348 530.8678 572.6095 584.9151 611.8428 656.3930 675.4158 721.2039 722.6980 741.8661 755.6689 787.9712 799.2271 814.8061 890.4620 928.4135 941.6547 958.6726 973.5898 1027.9199 1086.7124 1104.7066 1121.1174 1124.9926 1125.9318 1160.5626 1189.4939 1231.6034 1244.4986 1261.6466 1303.0556 1326.6243 1335.8712 1392.0306 1419.7953 1422.7326 1433.9435 1458.2014 1471.0475 1474.3836 1480.5415 1500.4552 1516.3528 1545.7969 1569.4073 1576.0910 1621.3762 1623.9490 2994.2477 3014.0864 3088.7590 3106.1205 3121.8999 3141.5024 3169.3720 3188.9179 3191.5693
redmass: 9.0836 3.1842 1.3466 2.9335 4.6271 8.4877 8.0913 1.0849 5.7438 6.2536 5.1802 9.4294 5.6394 3.7795 4.2024 6.4945 7.8564 6.9976 4.9490 8.9904 6.3023 3.8874 7.6293 8.6789 4.8320 6.9429 7.1868 7.9978 8.0917 11.3404 4.2498 6.4565 8.2474 5.5805 1.5705 1.4974 4.8695 1.3298 3.0215 4.7483 4.0193 2.5914 3.7268 1.3185 1.3162 1.6641 2.1070 2.9097 2.8480 6.5500 1.6893 4.8983 4.2560 4.6407 7.0918 1.2635 1.2962 3.6006 2.3103 1.0435 1.0978 1.4871 1.0454 6.8722 8.3534 8.4890 10.5750 10.4030 7.3869 1.0335 1.0328 1.1026 1.1019 1.1010 1.1025 1.0890 1.0958 1.0946
irintensity: 1.5615 5.1401 0.1077 2.9490 2.6512 0.0723 0.2657 0.1963 0.6372 0.3611 3.3585 0.2937 0.7636 5.2714 1.6082 1.5449 33.0969 1.3335 15.3094 4.4134 10.0459 0.1878 5.8045 5.8184 9.1391 9.0294 2.9372 10.9456 8.2866 10.7894 0.7598 2.8033 1.7043 26.2713 51.6085 33.1305 23.3006 0.1333 54.7589 14.5770 19.4307 24.9332 72.6940 0.0132 0.1331 30.4978 48.5275 105.1953 41.3648 74.4393 67.5358 2.2557 30.3959 82.7133 28.7067 124.9634 3.6208 20.1464 95.1071 17.6745 21.8513 5.0280 21.3151 27.2405 835.5723 109.0350 389.4921 43.1639 25.9348 29.6549 25.0027 14.6612 14.8617 1.9285 1.9496 1.1539 0.3849 5.5183
temp: 298.150 k
press: 1.00000 atm
elementType: 9 8 8 7 7 7 7 6 6 6 6 6 6 6 6 6 6 6 6 1 1 1 1 1 1 1 1 1
symmnumber: 1
zpe: 519863.8 jmol-1
zpe.correction: 0.198006 hartree
zpe.thermalcorrener: 0.213597 hartree
zpe.thermalcorrenthalpy: 0.214542 hartree
zpe.thermalcorrgfe: 0.155027 hartree
zpe.sumelectzpe: -930.662089 hartree
zpe.sumelectthermal: -930.646497 hartree
zpe.sumelectthermalent: -930.645553 hartree
zpe.sumelectthermalfe: -930.705068 hartree
dipole: 5.0643 3.7145 -0.0030
dipole: 6.2805
quadrupole: -117.7867 -114.4434 -107.3840
quadrupole: 19.8399 0.0107 -0.0034
quadrupole: -4.5820 -1.2387 5.8207 19.8399 0.0107 -0.0034
hfenergy: -930.8600944 hartree
pointgroup: C01 [X(C12H9F1N4O2)]
dipole: 1.9889053 1.4662422 -0.0011897 debye
polarizability: 326.7531223|-2.400576|171.7893419|0.0080316|-0.0009121|71.0079625 unknown
InChI: InChI=1S/C12H9FN4O2/c1-16-8-4-3-6(13)5-7(8)14-9-10(16)15-12(19)17(2)11(9)18/h3-5H,1-2H3
charge 0 multiplicity 1
28 atoms
F  5.21232 -1.384908 0.000583
O  -2.11052 -2.689817 -0.000092
O  -4.299543 1.448069 0.000873
N  0.389442 1.494916 -0.000474
N  -3.205489 -0.612538 -0.000714
N  0.386143 -1.359351 -0.000366
N  -1.964222 1.496724 -0.000458
C  1.611856 0.804746 -0.000246
C  -0.834737 0.799551 -0.000546
C  -0.748835 -0.669394 -0.000675
C  1.582954 -0.639422 -0.000161
C  -2.050304 -1.430821 -0.000698
C  0.361436 2.975794 -0.000593
C  2.863645 1.4776 -0.000028
C  2.798725 -1.375278 0.000113
C  -3.199514 0.833696 -0.000917
C  4.059106 0.739425 0.000242
C  4.00366 -0.67408 0.000301
C  -4.535263 -1.266679 -0.000176
H  0.862724 3.367144 -0.902848
H  0.86186 3.367309 0.902081
H  -0.69653 3.276855 -0.001053
H  2.913117 2.568271 -0.000022
H  2.756666 -2.467056 0.000159
H  5.03092 1.241785 0.000423
H  -5.103552 -0.959238 0.892803
H  -4.374643 -2.354425 -0.000781
H  -5.104619 -0.958277 -0.89213
