program: Gaussian 09
title: 000010292
version: EM64L-G09RevD.01
frameworkgroup: C1[X(C12H12N2)]
method: RPBEPBE
basis: SDD
operation: Freq
keyword: #pfreq=noraman
keyword: PBEPBE/SDD
title: #p freq=noraman PBEPBE/SDD
converged: YES YES NO NO
title: Mulliken charges:
elementType: N N C C C C C C C C C C C C H H H H H H H H H H H H
charge: -0.689700 -0.698031 0.152244 0.214659 0.301017 -0.351925 -0.351882 -0.364183 0.478462 -0.406839 -0.406852 -0.419154 -0.275501 -0.211657 0.242905 0.242882 0.237669 0.214404 0.214399 0.210876 0.220975 0.216703 0.327940 0.293612 0.303489 0.303489
chargesum: 0.00000
title: Mulliken charges with hydrogens summed into heavy atoms:
elementType: N N C C C C C C C C C C C C
charge: -0.068148 -0.091053 0.152244 0.214659 0.301017 -0.109020 -0.109000 -0.126514 0.478462 -0.192435 -0.192453 -0.208278 -0.054526 0.005046
polarizability: 2.14584085e+02 -7.61561561e+00 1.16344567e+02 1.03711364e-02 3.12943713e-02 1.01199633e+02
1716.lowfreq: -44.1460 -7.9326 -7.6536 -0.0003 -0.0002 0.0003 6.7751 60.1161 75.1551
frequency: -44.1234 60.1161 75.1492 176.7206 183.5081 253.2839 304.5851 331.5198 336.3479 358.4766 363.7692 377.9755 405.2442 440.4955 451.5248 480.3933 520.3178 556.8038 559.7943 579.9012 636.1967 686.5152 732.4911 743.8544 752.4055 812.8536 817.2271 823.1954 832.7817 843.5952 930.9727 940.1351 956.3875 963.2484 984.3964 1003.2114 1014.0611 1020.3099 1042.7263 1122.7805 1129.6276 1168.6069 1186.0129 1256.4161 1287.7308 1300.4776 1312.9529 1317.5739 1362.8607 1379.7368 1425.1151 1444.1605 1491.5010 1521.7780 1567.9145 1582.1367 1610.3573 1626.9797 1630.1791 1643.1540 3110.0089 3112.4138 3114.5582 3125.0948 3135.6524 3139.4206 3145.2688 3160.4997 3553.8734 3568.1726 3701.1369 3708.5550
redmass: 3.8027 4.6350 4.3210 4.3344 4.0581 5.7574 2.3825 1.2226 1.4282 4.2160 1.0419 2.7984 2.7249 3.5215 1.0438 3.1717 4.1812 2.9861 3.8223 6.0827 6.3165 5.4234 3.7632 1.6207 2.3035 4.3876 1.2578 2.2448 3.7791 1.4984 1.3718 1.3458 1.3484 1.3005 6.1065 2.1162 1.4460 1.9325 1.9438 1.2356 1.3601 1.0528 1.0993 2.3306 1.7597 1.3694 2.8663 2.2505 4.3243 8.3035 3.5670 2.6514 2.9489 3.4399 6.7634 6.1264 2.0851 2.3239 2.0774 1.6267 1.0861 1.0878 1.0875 1.0877 1.0944 1.0955 1.0968 1.1002 1.0447 1.0448 1.1039 1.1040
irintensity: 0.1072 1.7445 1.8737 4.1768 2.2940 0.0201 41.9263 288.1446 168.9698 30.5518 0.0787 0.3111 0.0075 3.8467 32.1032 4.4752 10.9678 16.8727 0.1143 5.9373 0.5813 0.0599 0.3247 47.2495 46.5882 18.4730 0.0856 59.0798 5.1633 3.1873 1.7262 0.6153 0.1028 0.0857 7.5158 3.6698 0.1438 6.9336 12.4157 17.2539 16.8000 5.5199 31.3368 8.1595 7.2789 2.0286 40.3070 65.1662 7.3900 18.8479 0.5252 21.9597 143.1248 66.9433 3.0464 10.3706 31.1805 163.5587 20.0118 305.1121 13.4586 7.2201 38.2764 1.2663 43.7540 33.2932 0.9981 32.3465 55.9759 71.9731 33.4806 19.9316
temp: 298.150 k
press: 1.00000 atm
elementType: 7 7 6 6 6 6 6 6 6 6 6 6 6 6 1 1 1 1 1 1 1 1 1 1 1 1
symmnumber: 1
zpe: 552047.9 jmol-1
zpe.correction: 0.210264 hartree
zpe.thermalcorrener: 0.221850 hartree
zpe.thermalcorrenthalpy: 0.222794 hartree
zpe.thermalcorrgfe: 0.173200 hartree
zpe.sumelectzpe: -573.011870 hartree
zpe.sumelectthermal: -573.000284 hartree
zpe.sumelectthermalent: -572.999340 hartree
zpe.sumelectthermalfe: -573.048934 hartree
dipole: -3.4511 1.8310 -0.0057
dipole: 3.9067
quadrupole: -60.2379 -77.1865 -80.6921
quadrupole: 2.5914 -0.0078 0.0023
quadrupole: 12.4676 -4.4810 -7.9866 2.5914 -0.0078 0.0023
hfenergy: -573.2221342 hartree
pointgroup: C01 [X(C12H12N2)]
dipole: 1.3570535 0.7217062 0.0015491 debye
dipolederiv: -0.4559294 -0.5009537 -0.0004242 -0.4256505 -1.1430047 0.0000553 -0.0001407 0.0007677 -0.6505704 -1.7029808 -0.018278 0.0000158 -0.0475476 -0.7460089 -0.0014964 -0.0000496 -0.0014925 -0.0876442 0.3422207 0.1201363 0.0000713 -0.3737455 -0.2930443 0.0000433 -0.0003528 -0.0001435 -0.149368 0.1088954 -0.0277689 0.0000209 0.0566158 -0.1336764 0.0001688 0.0001647 0.0002654 -0.2046196 0.1532439 0.5917951 0.0004354 0.5537338 1.1152106 0.0005746 0.0004142 0.0005066 0.127627 0.1370299 0.0065369 -0.138059 0.0044482 -0.0995593 0.0029816 -0.0716058 0.0047164 0.165557 0.1371456 0.0058734 0.1380673 0.0037524 -0.0995036 -0.0040907 0.071656 -0.0058189 0.1655354 0.1359805 -0.0082301 -0.00007 0.2289824 0.1477688 0.0002057 0.0000397 0.0002224 -0.1145962 1.7836138 0.0417872 0.000025 0.0468944 0.1353197 0.0003666 -0.0000066 0.0003904 -0.0300125 -0.4465767 0.003356 0.0689877 0.004486 -0.2283908 0.0039769 -0.3967003 -0.013491 0.0564101 -0.4467189 0.0037363 -0.0689444 0.0028146 -0.2284509 -0.005247 0.3967972 0.0122062 0.0564094 -0.1340509 -0.4480195 -0.0003684 0.0478843 -0.1297607 0.0000559 -0.0000319 0.0001056 -0.2327779 -0.3459833 0.0668951 0.0000637 0.0862721 -0.1204192 0.0000752 0.0002189 0.0001303 -0.2326953 0.1126197 0.0529438 0.0000172 -0.1694809 0.2400912 0.0002991 -0.0001402 0.000272 -0.1390425 0.0639848 -0.0064052 -0.0957428 -0.0102251 0.1246471 -0.0042613 -0.0983808 -0.0013054 -0.0453597 0.0639813 -0.0068313 0.0957396 -0.0106433 0.1246384 0.0050316 0.0983106 0.0019988 -0.0453546 0.0494328 0.1134959 0.0000804 0.107994 -0.0438466 -0.0001655 0.0000714 -0.0001296 0.1300369 -0.0460684 -0.0041474 0.1128788 -0.0068134 0.1626537 0.004794 0.1092395 0.0019511 -0.0711565 -0.0460899 -0.0036613 -0.1129049 -0.0062712 0.1626866 -0.0037388 -0.1092721 -0.0009332 -0.0711713 -0.0099797 0.0750555 0.0000687 0.1212038 -0.1126449 -0.000226 0.0001323 -0.000206 0.1642534 -0.0046718 -0.0886451 -0.0000611 -0.1123546 -0.0945727 -0.0002077 -0.0000624 -0.0002162 0.1731391 -0.1740906 -0.0117116 0.0000135 -0.0035784 0.090036 -0.0000482 0.000006 -0.000055 0.15313 0.2073586 0.0141663 -0.0000246 -0.1258822 0.2132883 -0.000118 -0.0004615 -0.0002325 0.297909 0.0946028 0.0376566 0.0001419 0.025885 0.1901873 -0.0002678 0.0001556 -0.0007345 0.3610735 0.211515 -0.0044215 0.010605 0.0005839 0.3831683 0.0032202 0.0302551 0.0023419 0.1116528 0.2115157 -0.0043609 -0.0106328 0.0006419 0.3831871 -0.0019814 -0.0302565 -0.0011166 0.1116353 unknown
polarizability: 214.5689022|7.7129152|116.3596767|0.0020598|-0.0458118|101.1997062 unknown
InChI: InChI=1S/C12H12N2/c13-10-7-5-9(6-8-10)11-3-1-2-4-12(11)14/h1-8H,13-14H2
charge 0 multiplicity 1
26 atoms
N  -1.176119 2.230538 0.001445
N  4.717097 -0.005193 0.000022
C  -1.057159 -0.217503 -0.000219
C  0.444144 -0.155475 -0.00016
C  -1.825454 0.994341 0.000752
C  1.181554 -0.120514 -1.214734
C  1.181635 -0.125856 1.214501
C  -1.73858 -1.456624 -0.001107
C  3.320611 -0.050798 -0.000029
C  2.590027 -0.071812 -1.223773
C  2.590107 -0.077168 1.223659
C  -3.248725 0.919284 0.000805
C  -3.151251 -1.530604 -0.001057
C  -3.900029 -0.330242 -0.000072
H  0.637965 -0.141106 -2.166628
H  0.6381 -0.150596 2.166328
H  -1.141678 -2.376468 -0.001857
H  3.130563 -0.053939 -2.178667
H  3.13071 -0.063466 2.178584
H  -3.837002 1.845931 0.001537
H  -3.65531 -2.502589 -0.001785
H  -4.996038 -0.365815 -0.000009
H  -0.159938 2.267269 0.001947
H  -1.704557 3.097194 0.003082
H  5.237746 -0.000969 0.871763
H  5.23768 0.002981 -0.87173
