program: Gaussian 09
title: 000144515
version: EM64L-G09RevD.01
frameworkgroup: C1[X(C8H20N4)]
method: RPBEPBE
basis: SDD
operation: Freq
keyword: #pfreq=noraman
keyword: PBEPBE/SDD
title: #p freq=noraman PBEPBE/SDD
converged: YES YES NO NO
title: Mulliken charges:
elementType: N N N N C C C C C C C C H H H H H H H H H H H H H H H H H H H H
charge: -0.103836 -0.092945 -0.092945 -0.103836 -0.013896 -0.013893 -0.746104 -0.746106 -0.605662 -0.641577 -0.641577 -0.605662 0.202105 0.202104 0.223786 0.239450 0.214132 0.223787 0.239450 0.214133 0.241330 0.215836 0.184876 0.224668 0.222027 0.235806 0.222028 0.235807 0.224668 0.184875 0.241331 0.215837
chargesum: 0.00000
title: Mulliken charges with hydrogens summed into heavy atoms:
elementType: N N N N C C C C C C C C
charge: -0.103836 -0.092945 -0.092945 -0.103836 0.188209 0.188211 -0.068735 -0.068737 0.036381 0.040925 0.040926 0.036381
polarizability: 1.27402758e+02 1.17469053e+00 1.14605668e+02 1.09612096e-03 7.85314434e-04 1.04456879e+02
1716.lowfreq: -14.0661 -11.5017 -0.0006 -0.0004 0.0006 17.1203 59.1600 101.9706 123.7045
frequency: 58.8666 101.9704 123.6496 145.8608 160.7641 161.2880 174.9358 214.2385 218.4919 234.7857 254.7558 278.3130 281.6557 296.4881 297.6740 332.6396 408.7518 433.7902 434.4515 444.9121 484.6606 515.7304 574.3057 602.9903 692.4886 708.2403 799.4223 812.0779 913.3545 917.3891 1000.8132 1005.6529 1040.6732 1055.5499 1061.4072 1078.8614 1101.3409 1107.9474 1111.2490 1114.0375 1119.4174 1148.2100 1163.2857 1165.8804 1170.9465 1188.5033 1241.4912 1241.5631 1330.9309 1331.6294 1356.9726 1359.4157 1383.9660 1386.5472 1412.8609 1412.9185 1415.0974 1418.2474 1456.7364 1457.4315 1461.6922 1465.6951 1466.6062 1469.3818 1472.5248 1472.6652 1479.9788 1480.4521 1487.8895 1506.3498 2840.3546 2859.8754 2882.5207 2885.3329 2937.6912 2943.0702 2995.9652 2996.3148 3035.2010 3038.5728 3038.6035 3039.5537 3091.6325 3092.3197 3102.4477 3102.7772 3106.2025 3106.6082 3107.4160 3107.6643
redmass: 2.8992 2.7179 1.9576 1.0734 1.1157 1.3170 1.5198 1.1519 1.6322 1.5950 1.7651 1.6302 2.0431 2.3150 2.3327 2.6894 4.1478 3.1788 3.1223 4.0134 4.3009 3.8790 3.0177 4.9419 3.3441 2.5968 2.4699 2.9603 2.3456 2.3677 1.7623 1.9704 1.7089 2.0052 2.4693 2.8408 1.3702 1.3369 1.4348 1.9017 2.0006 2.4693 2.0101 1.9462 2.1321 2.1173 4.8025 4.1654 1.2543 1.2603 1.3161 1.3432 1.2322 1.2783 1.1570 1.1579 1.1460 1.1332 1.0561 1.0579 1.0539 1.0513 1.0467 1.0583 1.0473 1.0468 1.0487 1.0492 1.0470 1.0516 1.0821 1.0821 1.0537 1.0549 1.0459 1.0439 1.0357 1.0357 1.0885 1.0831 1.0769 1.0835 1.0990 1.0987 1.0998 1.0997 1.0993 1.0987 1.0990 1.0989
irintensity: 0.0240 3.3792 0.0045 0.5234 0.1549 1.3357 0.3889 0.0030 8.7447 8.4383 0.0115 0.0583 4.2897 0.3559 0.1384 0.0323 0.5703 7.2947 2.2490 0.5320 11.9494 0.5368 7.3377 25.2353 9.1210 0.6109 14.5321 12.1333 5.8828 35.5114 11.7990 5.1584 18.6528 41.0522 6.1314 0.0746 12.8760 6.5947 16.1933 0.1294 0.3523 2.3788 22.3223 0.0555 0.6546 5.9153 26.1397 23.1419 25.3748 0.3570 0.7525 10.0113 0.3278 44.1179 4.7843 9.6996 27.8515 10.1794 7.6580 8.3192 0.6523 9.8686 6.3787 18.2810 6.5088 18.6643 1.8374 11.1584 3.9593 6.6338 10.9965 57.5184 20.9786 233.0930 16.3327 126.2396 45.5193 0.2954 94.0447 4.4116 89.4908 0.8907 4.9327 68.6619 5.2543 28.2601 0.3902 46.0990 22.9421 17.0007
temp: 298.150 k
press: 1.00000 atm
elementType: 7 7 7 7 6 6 6 6 6 6 6 6 1 1 1 1 1 1 1 1 1 1 1 1 1 1 1 1 1 1 1 1
symmnumber: 1
zpe: 741636.2 jmol-1
zpe.correction: 0.282474 hartree
zpe.thermalcorrener: 0.297191 hartree
zpe.thermalcorrenthalpy: 0.298135 hartree
zpe.thermalcorrgfe: 0.242965 hartree
zpe.sumelectzpe: -534.734903 hartree
zpe.sumelectthermal: -534.720186 hartree
zpe.sumelectthermalent: -534.719241 hartree
zpe.sumelectthermalfe: -534.774412 hartree
dipole: 0.0000 0.0001 -0.7413
dipole: 0.7413
quadrupole: -73.4219 -77.3678 -73.6083
quadrupole: 0.3170 0.0000 -0.0003
quadrupole: 1.3774 -2.5684 1.1910 0.3170 0.0000 -0.0003
hfenergy: -535.0173769 hartree
pointgroup: C01 [X(C8H20N4)]
dipole: -0.0000131 0.0000291 0.2916643 debye
polarizability: 126.9183219|-2.7100908|115.0901043|0.0009905|-0.0009149|104.4568788 unknown
InChI: InChI=1S/C8H20N4/c1-7-9(3)11(5)8(2)12(6)10(7)4/h7-8H,1-6H3
charge 0 multiplicity 1
32 atoms
N  1.162289 0.922223 0.031331
N  -0.221086 1.344597 -0.246359
N  0.221106 -1.344704 -0.24612
N  -1.162292 -0.922281 0.031393
C  1.224696 -0.54526 0.462201
C  -1.224727 0.545271 0.462021
C  2.647467 -1.089993 0.264412
C  -2.647485 1.089974 0.26405
C  1.753502 1.823209 1.055041
C  -0.458879 1.660047 -1.671323
C  0.459006 -1.660377 -1.671021
C  -1.753588 -1.823101 1.055201
H  0.972151 -0.612715 1.5511
H  -0.972254 0.612899 1.550926
H  2.673828 -2.166534 0.509577
H  2.980439 -0.943571 -0.776615
H  3.36114 -0.569865 0.92618
H  -2.673859 2.166557 0.509029
H  -2.980393 0.943375 -0.776973
H  -3.361201 0.569961 0.925863
H  1.624257 2.864835 0.722523
H  2.833972 1.614038 1.149445
H  1.281439 1.715975 2.062231
H  -1.272543 2.403335 -1.752164
H  -0.72412 0.78602 -2.302763
H  0.465061 2.111866 -2.064843
H  0.724311 -0.78645 -2.302572
H  -0.464912 -2.112238 -2.064542
H  1.272662 -2.403693 -1.751684
H  -1.281617 -1.715693 2.062416
H  -1.624302 -2.864781 0.722869
H  -2.834069 -1.613926 1.149472
