program: Gaussian 09
title: 000144497
version: EM64L-G09RevD.01
frameworkgroup: C1[X(C12H18OS)]
method: RPBEPBE
basis: SDD
operation: Freq
keyword: #p
keyword: freq=noraman
keyword: PBEPBE/SDD
title: #p freq=noraman PBEPBE/SDD
converged: NO YES NO NO
title: Mulliken charges:
elementType: S O C C C C C C C C C C C C H H H H H H H H H H H H H H H H H H
charge: 0.660458 -0.630808 0.346173 0.379267 -0.465628 -0.468924 -0.825508 -0.848743 -0.528956 -0.518761 -0.422035 -0.417596 -0.213403 -0.211928 0.276897 0.191426 0.226443 0.197190 0.290582 0.281145 0.257389 0.328272 0.230059 0.218854 0.221213 0.219016 0.211971 0.190847 0.206716 0.201955 0.208351 0.208068
chargesum: 0.00000
title: Mulliken charges with hydrogens summed into heavy atoms:
elementType: S O C C C C C C C C C C C C
charge: 0.660458 -0.630808 0.346173 0.379267 0.002695 -0.045291 -0.253782 -0.263082 -0.080043 -0.078532 -0.019217 -0.008926 -0.005052 -0.003860
polarizability: 1.49484447e+02 -6.52222416e+00 1.33198530e+02 -2.31243176e-01 -3.25082551e+00 1.35953896e+02
1716.lowfreq: -19.2148 -11.4104 -0.0018 -0.0015 -0.0013 5.4240 76.2150 106.4847 150.4179
frequency: 76.0914 106.4006 150.4026 172.0758 203.0782 221.1332 250.9117 288.2957 317.3284 333.0985 340.5549 374.4262 382.4236 411.5089 444.0283 478.5970 483.9628 520.6990 561.5944 601.6201 618.4280 632.8861 664.5666 751.4163 776.6264 798.8018 832.3632 836.0981 860.2418 876.6660 882.9879 901.4387 920.1170 931.7486 974.8815 977.1861 984.3963 1005.6879 1033.4200 1041.3423 1059.8929 1074.4482 1088.6186 1116.3225 1142.6060 1157.6856 1177.7203 1181.8599 1188.2053 1208.3243 1220.3490 1227.1521 1244.5046 1269.5760 1271.6858 1288.1026 1321.6053 1328.8818 1334.1005 1343.9021 1353.8601 1356.9266 1379.8349 1422.9415 1442.0060 1449.9860 1458.6900 1466.6507 1475.6536 1480.8776 1492.0714 1684.2441 2932.0845 2961.0448 2965.4235 2968.7649 2971.6354 2982.8763 2987.6112 2999.6078 3019.2854 3022.7946 3031.6192 3031.8209 3040.7229 3044.9368 3096.6375 3119.2760 3128.0219 3128.1187
redmass: 5.1475 3.0463 3.7818 3.1643 2.8453 4.4082 4.0839 2.7081 2.4694 2.0247 2.2860 2.0425 3.3553 2.5051 2.9477 3.8824 3.4913 4.0108 2.4723 4.8726 3.4836 3.4081 1.2179 3.1524 10.7659 1.6009 2.0508 2.2538 2.0506 1.8698 1.9556 1.9203 2.1569 2.0729 1.4613 1.6057 1.7497 1.8662 1.5937 1.7981 1.6007 1.9960 1.7115 1.8782 1.6222 1.5502 1.5187 1.5443 1.3415 1.2147 1.4966 1.2840 1.5683 1.5306 1.3591 1.5840 1.5369 1.6774 1.5249 1.4029 1.4518 1.4137 1.6009 1.0992 1.1005 1.0830 1.0876 1.0827 1.0798 1.0844 1.0850 6.5326 1.0654 1.0602 1.0603 1.0600 1.0664 1.0639 1.0926 1.0980 1.1006 1.0979 1.0972 1.0574 1.0611 1.0976 1.0838 1.1091 1.1084 1.0996
irintensity: 7.5416 2.7439 3.0289 1.3538 0.6616 3.1241 4.3567 1.0549 1.4429 2.9145 0.4022 0.1687 4.2953 2.2206 2.2109 3.5463 5.3735 1.1210 0.1308 1.3548 0.7959 1.3384 48.0653 2.7506 45.8219 3.9651 1.4389 4.4312 0.7146 0.9549 1.7872 5.2564 0.3404 4.4493 4.0039 5.7466 0.5031 4.9188 0.3373 0.3229 9.6086 5.1624 0.0223 0.8050 0.0171 0.7095 2.1300 0.6949 1.1708 1.4974 4.2588 0.2295 0.2196 0.1029 3.2314 0.8710 2.3884 4.2165 0.7025 0.3980 0.2047 1.9529 0.3646 14.8706 13.9801 7.3797 10.7814 2.9699 14.9286 16.8311 14.7503 5.0151 33.7366 14.6271 22.7407 20.0817 52.4411 32.5135 28.0692 21.6442 36.2102 16.6629 49.6551 10.4567 9.7307 72.1350 7.4440 3.4864 4.6189 63.1943
temp: 298.150 k
press: 1.00000 atm
elementType: 16 8 6 6 6 6 6 6 6 6 6 6 6 6 1 1 1 1 1 1 1 1 1 1 1 1 1 1 1 1 1 1
symmnumber: 1
zpe: 718723.0 jmol-1
zpe.correction: 0.273747 hartree
zpe.thermalcorrener: 0.286524 hartree
zpe.thermalcorrenthalpy: 0.287468 hartree
zpe.thermalcorrgfe: 0.235986 hartree
zpe.sumelectzpe: -940.188860 hartree
zpe.sumelectthermal: -940.176083 hartree
zpe.sumelectthermalent: -940.175139 hartree
zpe.sumelectthermalfe: -940.226621 hartree
dipole: 4.9803 -0.9939 0.9388
dipole: 5.1645
quadrupole: -111.9795 -89.5651 -86.7800
quadrupole: 2.1486 -3.8510 -0.0028
quadrupole: -15.8713 6.5431 9.3282 2.1486 -3.8510 -0.0028
hfenergy: -940.4626068 hartree
pointgroup: C01 [X(C12H18O1S1)]
dipole: -1.9950613 0.0405811 -0.3828929 debye
polarizability: 151.4362361|2.5638047|131.0458257|0.6479482|3.0960545|136.1548113 unknown
InChI: InChI=1S/C12H18OS/c13-14-9-11-5-1-2-6-12(11,10-14)8-4-3-7-11/h1-2H,3-10H2
charge 0 multiplicity 1
32 atoms
S  2.164608 -1.503505 -0.217294
O  3.44462 -0.584111 0.369011
C  -0.056991 -0.036571 0.753489
C  -0.198243 -0.032204 -0.82255
C  0.744838 1.214577 1.237648
C  -0.774527 1.331359 -1.317915
C  0.735621 -1.312092 1.105705
C  1.207647 -0.274298 -1.409647
C  -1.445585 -0.069343 1.464916
C  -1.116372 -1.200031 -1.306813
C  0.17149 2.554904 0.72064
C  0.017812 2.561362 -0.817488
C  -2.48468 -0.944276 0.799688
C  -2.345676 -1.437677 -0.457019
H  1.80513 1.108673 0.934816
H  0.744638 1.214583 2.347121
H  -1.826655 1.404123 -0.976041
H  -0.805708 1.327421 -2.426218
H  1.274116 -1.260044 2.065747
H  0.131274 -2.23145 1.036267
H  1.179174 -0.756786 -2.399921
H  1.879329 0.597464 -1.416985
H  -1.8444 0.963026 1.541256
H  -1.295871 -0.396407 2.514798
H  -0.532922 -2.146194 -1.358285
H  -1.419233 -0.993049 -2.35417
H  0.83754 3.380326 1.036722
H  -0.815314 2.758184 1.184002
H  -0.49769 3.485226 -1.143778
H  1.02102 2.584409 -1.28676
H  -3.398029 -1.158141 1.371625
H  -3.13936 -2.062659 -0.888667
